{"text_format":"1","workbook":"xlsx","n_sheets":5,"sheets":["HomeTeam","RecordingSheet","AwayTeam","HomeTeamAnalysis","AwayTeamAnalysis"],"not_rendered":{"charts":0,"images":0,"macros":1,"external_links":0,"defined_names":8,"comments":0,"pivot_tables":0},"unopened":[],"bounds":{"document_bytes":16777216,"sheet_cells":100000,"rows_first":2000,"rows_last":500,"rows_between":2000,"halvings":0,"cell_chars":16384,"cell_head_chars":4096},"cells_cut":0,"cells_raw":0,"read":"whole","date_system":"1900"}

{"sheet":"HomeTeam","index":0,"n_rows":37,"n_cols":10,"rows_kept":37,"cut":false,"hidden":false,"merged":[[1,0,1,9],[3,2,3,4],[5,0,8,0],[5,5,8,5],[33,0,36,0],[33,5,36,5],[9,0,12,0],[9,5,12,5],[29,0,32,0],[29,5,32,5]]}
[]
["BELFAST TELEGRAPH TELETOTS MARSHALLING SHEET"]
[]
["Home Team:",null,"Lecale",null,null,{"$f":"A4","v":"Home Team:"},null,{"$f":"C4","v":"Lecale"}]
["Event No","Event","Lane 2","Lane 4","Lane 6","Event No","Event","Lane 2","Lane 4","Lane 6"]
[1,"Group A Medley Relay","Lucas O Neil","Aoife Mason",null,2,"Group B Medley Relay","Sasha Tindal","Charlotte Savage"]
[null,"Group A Medley Relay","Essie Costello ","Mark Knight",null,null,"Group B Medley Relay","Sophie Rossiter","Olivia Miskelly"]
[null,"Group A Medley Relay","Cormac Byrne","Enya Clarke",null,null,"Group B Medley Relay","Micheal Uhomobhi","Tom Costello"]
[null,"Group A Medley Relay","Lucas O'Neil","Henry Costello",null,null,"Group B Medley Relay","Sasha Tindal","Niall Mc Cauley"]
[3,"Group C Medley Relay","Ellen Doran","Sarah Burns",null,4,"Group D Medley Relay","Tom  Mc Cormack","Adam Colgan"]
[null,"Group C Medley Relay","Thomas Nay","Noah Sheridan",null,null,"Group D Medley Relay","Kiera Knight","Christopher Mason"]
[null,"Group C Medley Relay","Emily Burns","Amy Quinn",null,null,"Group D Medley Relay","Alicia Dobbin","Catriona Clarke"]
[null,"Group C Medley Relay","Ben Murtagh","Thomas Hanlon",null,null,"Group D Medley Relay","Tom Mc Cormack","Bebhionn Rogan"]
[5,"Girls Group A Backstroke","Essie Costello","Enya Clarke",null,6,"Boys Group A Backstroke","Mark Knight","Henry Costello","Cormac Byrne"]
[7,"Girls Group B Backstroke","Charlotte Savage","Olivia Miskelly",null,8,"Boys Group B Backstroke","Tom Costello","Niall Mc Cauley","Micheal Uhomobhi"]
[9,"Girls Group C Backstroke","Ellen Doran","Amy Quinn",null,10,"Boys Group C Backstroke","Thomas Nay","Ben Murtagh","Noah Sheridan"]
[11,"Girls Group D Backstroke","Bebhionn Rogan","Catriona Clarke",null,12,"Boys Group D Backstroke","Christopher Mason","Adam Colgan","Tom Mc Cormack"]
[13,"Girls Group A Breaststroke","Essie Costello","Enya Clarke",null,14,"Boys Group A Breaststroke","Mark Knight","Henry Costello","Lucas O'Neill"]
[15,"Girls Group B Breaststroke","Charlotte Savage","Olivia Miskelly",null,16,"Boys Group B Breaststroke","Tom Costello","Niall Mc Cauley","Micheal Uhomobhi"]
[17,"Girls Group C Breaststroke","Amy Quinn","Emily Burns",null,18,"Boys Group C Breaststroke","Thomas Nay","Noah Sheridan","Ben Murtagh"]
[19,"Girls Group D Breaststroke","Alicia Dobbin","Kiera Knight",null,20,"Boys Group D Breaststroke","Christopher Mason","Adam Colgan","Tom Mc Cormack"]
[21,"Girls Group A Butterfly","Essie Costello","Enya Clarke",null,22,"Boys Group A Butterfly","Mark Knight","Henry Costello","Cormac Byrne"]
[23,"Girls Group B Butterfly","Charlotte Savage","Olivia Miskelly",null,24,"Boys Group B Butterfly","Tom Costello","Niall Mc Cauley","Micheal Uhomobhi"]
[25,"Girls Group C Butterfly","Emily Burns","Amy Quinn",null,26,"Boys Group C Butterfly","Thomas Hanlon","Thomas Nay","Noah Sheridan"]
[27,"Girls Group D Butterfly","Bebhionn Rogan","Catriona Clarke",null,28,"Boys Group D Butterfly","Tom Mc Cormack","Adam Colgan","Christopher Mason"]
[29,"Girls Group A Front Crawl","Essie Costello ","Enya Clarke",null,30,"Boys Group A Front Crawl","Mark Knight","Henry Costello","Lucas O'Neill"]
[31,"Girls Group B Front Crawl","Charlotte Savage","Olivia Miskelly",null,32,"Boys Group B Front Crawl","Tom Costello","Niall Mc Cauley","Micheal Uhomobhi"]
[33,"Girls Group C Front Crawl","Emily Burns","Amy Quinn",null,34,"Boys Group C Front Crawl","Noah Sheridan","Thomas Hanlon","Ben Murtagh"]
[35,"Girls Group D Front Crawl","Catriona Clarke","Bebhionn Rogan",null,36,"Boys Group D Front Crawl","Tom Mc Cormack","Adam Colgan","Christopher Mason"]
[37,"Group A Freestyle Relay","Lucas O Neil","Mark Knight",null,38,"Group B Freestyle Relay","Micheal Uhomobhi","Tom Costello"]
[null,"Group A Freestyle Relay","Aoife Mason","Essie Costello",null,null,"Group B Freestyle Relay","Sasha Tindal","Charlotte Savage"]
[null,"Group A Freestyle Relay","Cormac Byrne","Enya Clarke",null,null,"Group B Freestyle Relay","Sophie Rossiter","Olivia Miskelly"]
[null,"Group A Freestyle Relay","Lucas O Neil","Henry Costello",null,null,"Group B Freestyle Relay","Dan Colgan","Niall Mc Cauley"]
[39,"Group C Freestyle Relay","Thomas Nay","Thomas Hanlon",null,40,"Group D Freestyle Relay","Christopher Mason","Tom Mc Cormack"]
[null,"Group C Freestyle Relay","Ellen Doran","Emily Burns",null,null,"Group D Freestyle Relay","Kiera Knight","Catriona Clarke"]
[null,"Group C Freestyle Relay","Sarah Burns","Amy Quinn",null,null,"Group D Freestyle Relay","Alicia Dobbin","Bebhionn Rogan"]
[null,"Group C Freestyle Relay","Ben Murtagh","Noah Sheridan",null,null,"Group D Freestyle Relay","Christopher Mason","Adam Colgan"]

{"sheet":"RecordingSheet","index":1,"n_rows":308,"n_cols":9,"rows_kept":308,"cut":false,"hidden":false,"merged":[[289,1,292,1],[293,1,296,1],[229,1,231,1],[232,1,234,1],[235,1,237,1],[238,1,240,1],[297,1,300,1],[301,1,304,1],[273,1,276,1],[277,1,280,1],[281,1,284,1],[285,1,288,1],[256,1,258,1],[259,1,261,1],[262,1,264,1],[217,1,219,1],[220,1,222,1],[223,1,225,1],[226,1,228,1],[253,1,255,1],[183,1,185,1],[162,1,164,1],[165,1,167,1],[168,1,170,1],[171,1,173,1],[198,1,200,1],[201,1,203,1],[204,1,206,1],[207,1,209,1],[186,1,188,1],[189,1,191,1],[192,1,194,1],[195,1,197,1],[241,1,243,1],[244,1,246,1],[247,1,249,1],[250,1,252,1],[149,1,151,1],[152,1,154,1],[131,1,133,1],[134,1,136,1],[137,1,139,1],[140,1,142,1],[174,1,176,1],[177,1,179,1],[180,1,182,1],[122,1,124,1],[125,1,127,1],[128,1,130,1],[107,1,109,1],[110,1,112,1],[113,1,115,1],[116,1,118,1],[143,1,145,1],[146,1,148,1],[88,1,90,1],[91,1,93,1],[94,1,96,1],[97,1,99,1],[76,1,78,1],[79,1,81,1],[82,1,84,1],[85,1,87,1],[119,1,121,1],[13,1,16,1],[17,1,20,1],[21,1,24,1],[25,1,28,1],[64,1,66,1],[67,1,69,1],[70,1,72,1],[73,1,75,1],[52,1,54,1],[55,1,57,1],[58,1,60,1],[61,1,63,1],[33,6,36,6],[33,8,36,8],[37,6,40,6],[37,7,40,7],[33,7,36,7],[37,8,40,8],[41,7,44,7],[29,1,32,1],[33,1,36,1],[37,1,40,1],[41,1,44,1],[273,7,276,7],[273,6,276,6],[277,6,280,6],[277,8,280,8],[273,8,276,8],[277,7,280,7],[297,6,300,6],[301,6,304,6],[281,7,284,7],[285,8,288,8],[281,6,284,6],[285,6,288,6],[289,6,292,6],[293,6,296,6],[281,8,284,8],[285,7,288,7],[297,8,300,8],[301,7,304,7],[289,7,292,7],[293,8,296,8],[297,7,300,7],[301,8,304,8],[289,8,292,8],[293,7,296,7],[3,1,3,7],[51,3,51,4],[180,3,180,4],[23,3,23,4],[51,7,51,8],[52,3,52,4],[53,3,53,4],[24,3,24,4],[25,3,25,4],[26,3,26,4],[17,6,20,6],[17,8,20,8],[21,6,24,6],[21,7,24,7],[17,7,20,7],[21,8,24,8],[25,6,28,6],[25,8,28,8],[29,6,32,6],[29,7,32,7],[25,7,28,7],[29,8,32,8],[41,6,44,6],[41,8,44,8],[27,3,27,4],[28,3,28,4],[29,3,29,4],[54,3,54,4],[43,3,43,4],[44,3,44,4],[39,3,39,4],[40,3,40,4],[41,3,41,4],[42,3,42,4],[55,3,55,4],[30,3,30,4],[31,3,31,4],[32,3,32,4],[33,3,33,4],[34,3,34,4],[35,3,35,4],[36,3,36,4],[37,3,37,4],[38,3,38,4],[62,3,62,4],[63,3,63,4],[64,3,64,4],[65,3,65,4],[66,3,66,4],[67,3,67,4],[56,3,56,4],[57,3,57,4],[58,3,58,4],[59,3,59,4],[60,3,60,4],[61,3,61,4],[74,3,74,4],[75,3,75,4],[76,3,76,4],[77,3,77,4],[78,3,78,4],[79,3,79,4],[68,3,68,4],[69,3,69,4],[70,3,70,4],[71,3,71,4],[72,3,72,4],[73,3,73,4],[86,3,86,4],[87,3,87,4],[88,3,88,4],[89,3,89,4],[90,3,90,4],[91,3,91,4],[80,3,80,4],[81,3,81,4],[82,3,82,4],[83,3,83,4],[84,3,84,4],[85,3,85,4],[98,3,98,4],[99,3,99,4],[106,7,106,8],[107,3,107,4],[108,3,108,4],[109,3,109,4],[106,3,106,4],[107,8,109,8],[92,3,92,4],[93,3,93,4],[94,3,94,4],[95,3,95,4],[96,3,96,4],[97,3,97,4],[116,3,116,4],[117,3,117,4],[118,3,118,4],[119,3,119,4],[120,3,120,4],[121,3,121,4],[110,3,110,4],[111,3,111,4],[112,3,112,4],[113,3,113,4],[114,3,114,4],[115,3,115,4],[128,3,128,4],[129,3,129,4],[130,3,130,4],[131,3,131,4],[132,3,132,4],[133,3,133,4],[122,3,122,4],[123,3,123,4],[124,3,124,4],[125,3,125,4],[126,3,126,4],[127,3,127,4],[145,3,145,4],[138,3,138,4],[139,3,139,4],[140,3,140,4],[141,3,141,4],[142,3,142,4],[134,3,134,4],[135,3,135,4],[136,3,136,4],[137,3,137,4],[143,3,143,4],[144,3,144,4],[150,3,150,4],[151,3,151,4],[152,3,152,4],[153,3,153,4],[273,3,273,4],[163,3,163,4],[164,3,164,4],[165,3,165,4],[166,3,166,4],[173,3,173,4],[174,3,174,4],[271,3,271,4],[185,3,185,4],[186,3,186,4],[195,3,195,4],[196,3,196,4],[197,3,197,4],[198,3,198,4],[199,3,199,4],[200,3,200,4],[218,3,218,4],[219,3,219,4],[220,3,220,4],[221,3,221,4],[271,7,271,8],[175,3,175,4],[176,3,176,4],[177,3,177,4],[178,3,178,4],[179,3,179,4],[189,3,189,4],[190,3,190,4],[191,3,191,4],[192,3,192,4],[193,3,193,4],[194,3,194,4],[182,3,182,4],[181,3,181,4],[183,3,183,4],[184,3,184,4],[187,3,187,4],[188,3,188,4],[201,3,201,4],[202,3,202,4],[203,3,203,4],[204,3,204,4],[205,3,205,4],[206,3,206,4],[222,3,222,4],[223,3,223,4],[207,3,207,4],[208,3,208,4],[209,3,209,4],[216,3,216,4],[217,3,217,4],[241,3,241,4],[230,3,230,4],[231,3,231,4],[232,3,232,4],[233,3,233,4],[234,3,234,4],[235,3,235,4],[224,3,224,4],[225,3,225,4],[226,3,226,4],[227,3,227,4],[228,3,228,4],[229,3,229,4],[154,3,154,4],[162,3,162,4],[161,3,161,4],[146,3,146,4],[147,3,147,4],[148,3,148,4],[149,3,149,4],[260,3,260,4],[253,3,253,4],[254,3,254,4],[255,3,255,4],[256,3,256,4],[167,3,167,4],[169,3,169,4],[168,3,168,4],[248,3,248,4],[249,3,249,4],[250,3,250,4],[251,3,251,4],[252,3,252,4],[259,3,259,4],[242,3,242,4],[243,3,243,4],[244,3,244,4],[278,3,278,4],[279,3,279,4],[280,3,280,4],[281,3,281,4],[282,3,282,4],[283,3,283,4],[277,3,277,4],[170,3,170,4],[171,3,171,4],[172,3,172,4],[261,3,261,4],[262,3,262,4],[263,3,263,4],[264,3,264,4],[257,3,257,4],[258,3,258,4],[245,3,245,4],[246,3,246,4],[247,3,247,4],[236,3,236,4],[237,3,237,4],[238,3,238,4],[239,3,239,4],[240,3,240,4],[290,3,290,4],[291,3,291,4],[292,3,292,4],[293,3,293,4],[294,3,294,4],[295,3,295,4],[284,3,284,4],[285,3,285,4],[286,3,286,4],[287,3,287,4],[288,3,288,4],[289,3,289,4],[296,3,296,4],[297,3,297,4],[302,3,302,4],[303,3,303,4],[304,3,304,4],[298,3,298,4],[299,3,299,4],[300,3,300,4],[301,3,301,4],[22,3,22,4],[17,3,17,4],[18,3,18,4],[19,3,19,4],[20,3,20,4],[11,3,11,4],[11,7,11,8],[13,3,13,4],[14,3,14,4],[13,6,16,6],[13,7,16,7],[15,3,15,4],[16,3,16,4],[13,5,16,5],[13,8,16,8],[277,5,280,5],[281,5,284,5],[285,5,288,5],[289,5,292,5],[49,0,49,8],[274,3,274,4],[275,3,275,4],[276,3,276,4],[9,0,9,8],[33,5,36,5],[37,5,40,5],[52,8,54,8],[55,7,57,7],[17,5,20,5],[21,5,24,5],[25,5,28,5],[29,5,32,5],[41,5,44,5],[273,5,276,5],[269,0,269,8],[214,0,214,8],[159,0,159,8],[104,0,104,8],[21,3,21,4],[297,5,300,5],[301,5,304,5],[293,5,296,5],[76,8,78,8],[79,7,81,7],[82,8,84,8],[85,7,87,7],[88,8,90,8],[91,7,93,7],[131,8,133,8],[134,7,136,7],[137,8,139,8],[165,7,167,7],[168,8,170,8],[171,7,173,7],[174,8,176,8],[177,7,179,7],[180,8,182,8],[140,7,142,7],[143,8,145,8],[146,7,148,7],[149,8,151,8],[152,7,154,7],[162,8,164,8],[58,8,60,8],[61,7,63,7],[64,8,66,8],[67,7,69,7],[70,8,72,8],[73,7,75,7],[122,7,124,7],[125,8,127,8],[128,7,130,7],[94,8,96,8],[97,7,99,7],[110,7,112,7],[113,8,115,8],[116,7,118,7],[119,8,121,8],[161,7,161,8],[201,7,203,7],[204,8,206,8],[207,7,209,7],[217,8,219,8],[220,7,222,7],[223,8,225,8],[183,7,185,7],[186,8,188,8],[189,7,191,7],[192,8,194,8],[195,7,197,7],[198,8,200,8],[216,7,216,8],[256,7,258,7],[259,8,261,8],[262,7,264,7],[244,7,246,7],[247,8,249,8],[250,7,252,7],[253,8,255,8],[226,7,228,7],[229,8,231,8],[232,7,234,7],[235,8,237,8],[238,7,240,7],[241,8,243,8]]}
[]
[null,"BELFAST TELEGRAPH TELETOTS GALA SCORING SHEET"]
[]
[null,{"$f":"CONCATENATE(HomeTeam!C4,\" Vs \",AwayTeam!C4)","v":"Lecale Vs Ballymoney"}]
[]
["Final Score:",null,{"$f":"I308","v":227},"Points",null,{"$f":"H308","v":173},"Points"]
[]
["Date: ",null,null,null,null,null,"Venue:  ",{"$f":"HomeTeam!C4","v":"Lecale"}]
[]
["MEDLEY TEAM RELAY"]
[]
["Event","Club","Lane","Swimmer",null,"Time","Place","Points"]
[]
[1,{"$f":"AwayTeam!$C$4","v":"Ballymoney"},null,{"$f":"IF(AwayTeam!D6=\"\",\"\",AwayTeam!D6)","v":"Jayne McNeill"},null,"1.53.75",2,{"$f":"CalcRelayPoints(G14)","v":3}]
[null,null,3,{"$f":"IF(AwayTeam!D7=\"\",\"\",AwayTeam!D7)","v":"Harris Fleming"}]
[null,null,null,{"$f":"IF(AwayTeam!D8=\"\",\"\",AwayTeam!D8)","v":"Matthew Nicholl"}]
["A",null,null,{"$f":"IF(AwayTeam!D9=\"\",\"\",AwayTeam!D9)","v":"Leanne Balmer"}]
[null,{"$f":"HomeTeam!$C$4","v":"Lecale"},null,{"$f":"IF(HomeTeam!D6=\"\",\"\",HomeTeam!D6)","v":"Aoife Mason"},null,"1.51.19",{"$f":"IF(G14=\"\",\"\",IF(G14=1,2,1))","v":1},null,{"$f":"CalcRelayPoints(G18)","v":7}]
[null,null,4,{"$f":"IF(HomeTeam!D7=\"\",\"\",HomeTeam!D7)","v":"Mark Knight"}]
[null,null,null,{"$f":"IF(HomeTeam!D8=\"\",\"\",HomeTeam!D8)","v":"Enya Clarke"}]
[null,null,null,{"$f":"IF(HomeTeam!D9=\"\",\"\",HomeTeam!D9)","v":"Henry Costello"}]
[2,{"$f":"AwayTeam!$C$4","v":"Ballymoney"},null,{"$f":"IF(AwayTeam!I6=\"\",\"\",AwayTeam!I6)","v":"Joe Colley"},null,"1.34.25",2,{"$f":"CalcRelayPoints(G22)","v":3}]
[null,null,3,{"$f":"IF(AwayTeam!I7=\"\",\"\",AwayTeam!I7)","v":"James Green"}]
[null,null,null,{"$f":"IF(AwayTeam!I8=\"\",\"\",AwayTeam!I8)","v":"Sophie McCormick"}]
["B",null,null,{"$f":"IF(AwayTeam!I9=\"\",\"\",AwayTeam!I9)","v":"Daisy Dunlop"}]
[null,{"$f":"HomeTeam!$C$4","v":"Lecale"},null,{"$f":"IF(HomeTeam!I6=\"\",\"\",HomeTeam!I6)","v":"Charlotte Savage"},null,"1.29.72",{"$f":"IF(G22=\"\",\"\",IF(G22=1,2,1))","v":1},null,{"$f":"CalcRelayPoints(G26)","v":7}]
[null,null,4,{"$f":"IF(HomeTeam!I7=\"\",\"\",HomeTeam!I7)","v":"Olivia Miskelly"}]
[null,null,null,{"$f":"IF(HomeTeam!I8=\"\",\"\",HomeTeam!I8)","v":"Tom Costello"}]
[null,null,null,{"$f":"IF(HomeTeam!I9=\"\",\"\",HomeTeam!I9)","v":"Niall Mc Cauley"}]
[3,{"$f":"AwayTeam!$C$4","v":"Ballymoney"},null,{"$f":"IF(AwayTeam!D10=\"\",\"\",AwayTeam!D10)","v":"Reece Doherty"},null,"1.21.50",1,{"$f":"CalcRelayPoints(G30)","v":7}]
[null,null,3,{"$f":"IF(AwayTeam!D11=\"\",\"\",AwayTeam!D11)","v":"Alfie McFaull"}]
[null,null,null,{"$f":"IF(AwayTeam!D12=\"\",\"\",AwayTeam!D12)","v":"Molly Atchison"}]
["C",null,null,{"$f":"IF(AwayTeam!D13=\"\",\"\",AwayTeam!D13)","v":"Chloe Nicholl"}]
[null,{"$f":"HomeTeam!$C$4","v":"Lecale"},null,{"$f":"IF(HomeTeam!D10=\"\",\"\",HomeTeam!D10)","v":"Sarah Burns"},null,"1.26.34",{"$f":"IF(G30=\"\",\"\",IF(G30=1,2,1))","v":2},null,{"$f":"CalcRelayPoints(G34)","v":3}]
[null,null,4,{"$f":"IF(HomeTeam!D11=\"\",\"\",HomeTeam!D11)","v":"Noah Sheridan"}]
[null,null,null,{"$f":"IF(HomeTeam!D12=\"\",\"\",HomeTeam!D12)","v":"Amy Quinn"}]
[null,null,null,{"$f":"IF(HomeTeam!D13=\"\",\"\",HomeTeam!D13)","v":"Thomas Hanlon"}]
[4,{"$f":"AwayTeam!$C$4","v":"Ballymoney"},null,{"$f":"IF(AwayTeam!I10=\"\",\"\",AwayTeam!I10)","v":"Tea McWilliam"},null,"1.24.91",2,{"$f":"CalcRelayPoints(G38)","v":3}]
[null,null,3,{"$f":"IF(AwayTeam!I11=\"\",\"\",AwayTeam!I11)","v":"Jamie Watson"}]
[null,null,null,{"$f":"IF(AwayTeam!I12=\"\",\"\",AwayTeam!I12)","v":"Jessica Dunlop"}]
["D",null,null,{"$f":"IF(AwayTeam!I13=\"\",\"\",AwayTeam!I13)","v":"Angus Loughridge"}]
[null,{"$f":"HomeTeam!$C$4","v":"Lecale"},null,{"$f":"IF(HomeTeam!I10=\"\",\"\",HomeTeam!I10)","v":"Adam Colgan"},null,"1.17.06",{"$f":"IF(G38=\"\",\"\",IF(G38=1,2,1))","v":1},null,{"$f":"CalcRelayPoints(G42)","v":7}]
[null,null,4,{"$f":"IF(HomeTeam!I11=\"\",\"\",HomeTeam!I11)","v":"Christopher Mason"}]
[null,null,null,{"$f":"IF(HomeTeam!I12=\"\",\"\",HomeTeam!I12)","v":"Catriona Clarke"}]
[null,null,null,{"$f":"IF(HomeTeam!I13=\"\",\"\",HomeTeam!I13)","v":"Bebhionn Rogan"}]
[]
[]
[null,null,null,null,null,null,"Sub total",{"$f":"IF(SUM(H38,H30,H22,H14)=0,\"\",SUM(H38,H30,H22,H14))","v":16},{"$f":"IF(SUM(I42,I34,I26,I18)=0,\"\",SUM(I42,I34,I26,I18))","v":24}]
[]
["BACKSTROKE"]
[]
["Event","Club","Lane","Swimmer",null,"Time","Place","Points"]
[null,{"$f":"AwayTeam!$C$4","v":"Ballymoney"},1,{"$f":"IF(AwayTeam!C14=\"\",\"\",AwayTeam!C14)","v":"Leanne Balmer"},null,32.25,3,{"$f":"CalcPoints(G53)","v":2}]
[5,null,3,{"$f":"IF(AwayTeam!D14=\"\",\"\",AwayTeam!D14)","v":"Jayne McNeill"},null,28,2,{"$f":"CalcPoints(G54)","v":3}]
["A",null,5,{"$f":"IF(AwayTeam!E14=\"\",\"\",AwayTeam!E14)","v":"Erin Murray"},null,41.5,5,{"$f":"CalcPoints(G55)","v":""}]
["GIRLS",{"$f":"HomeTeam!$C$4","v":"Lecale"},2,{"$f":"IF(HomeTeam!C14=\"\",\"\",HomeTeam!C14)","v":"Essie Costello"},null,33.909999999999997,4,null,{"$f":"CalcPoints(G56)","v":1}]
[null,null,4,{"$f":"IF(HomeTeam!D14=\"\",\"\",HomeTeam!D14)","v":"Enya Clarke"},null,26.12,1,null,{"$f":"CalcPoints(G57)","v":4}]
[null,null,6,{"$f":"IF(HomeTeam!E14=\"\",\"\",HomeTeam!E14)","v":""},null,null,null,null,{"$f":"CalcPoints(G58)","v":""}]
[null,{"$f":"AwayTeam!$C$4","v":"Ballymoney"},1,{"$f":"IF(AwayTeam!H14=\"\",\"\",AwayTeam!H14)","v":"Harris Fleming"},null,28.1,3,{"$f":"CalcPoints(G59)","v":2}]
[6,null,3,{"$f":"IF(AwayTeam!I14=\"\",\"\",AwayTeam!I14)","v":"Matthew Nicholl"},null,28.29,2,{"$f":"CalcPoints(G60)","v":3}]
["A",null,5,{"$f":"IF(AwayTeam!J14=\"\",\"\",AwayTeam!J14)","v":""},null,null,null,{"$f":"CalcPoints(G61)","v":""}]
["BOYS",{"$f":"HomeTeam!$C$4","v":"Lecale"},2,{"$f":"IF(HomeTeam!H14=\"\",\"\",HomeTeam!H14)","v":"Mark Knight"},null,33.33,4,null,{"$f":"CalcPoints(G62)","v":1}]
[null,null,4,{"$f":"IF(HomeTeam!I14=\"\",\"\",HomeTeam!I14)","v":"Henry Costello"},null,24.37,1,null,{"$f":"CalcPoints(G63)","v":4}]
[null,null,6,{"$f":"IF(HomeTeam!J14=\"\",\"\",HomeTeam!J14)","v":"Cormac Byrne"},null,29.47,5,null,{"$f":"CalcPoints(G64)","v":""}]
[null,{"$f":"AwayTeam!$C$4","v":"Ballymoney"},1,{"$f":"IF(AwayTeam!C16=\"\",\"\",AwayTeam!C16)","v":"Daisy Dunlop"},null,29.53,4,{"$f":"CalcPoints(G65)","v":1}]
[7,null,3,{"$f":"IF(AwayTeam!D16=\"\",\"\",AwayTeam!D16)","v":"Sophie McCormick"},null,26.4,3,{"$f":"CalcPoints(G66)","v":2}]
["B",null,5,{"$f":"IF(AwayTeam!E16=\"\",\"\",AwayTeam!E16)","v":"Rachael Hill"},null,35,5,{"$f":"CalcPoints(G67)","v":""}]
["GIRLS",{"$f":"HomeTeam!$C$4","v":"Lecale"},2,{"$f":"IF(HomeTeam!C15=\"\",\"\",HomeTeam!C15)","v":"Charlotte Savage"},null,22.8,2,null,{"$f":"CalcPoints(G68)","v":3}]
[null,null,4,{"$f":"IF(HomeTeam!D15=\"\",\"\",HomeTeam!D15)","v":"Olivia Miskelly"},null,21.41,1,null,{"$f":"CalcPoints(G69)","v":4}]
[null,null,6,{"$f":"IF(HomeTeam!E15=\"\",\"\",HomeTeam!E15)","v":""},null,null,null,null,{"$f":"CalcPoints(G70)","v":""}]
[null,{"$f":"AwayTeam!$C$4","v":"Ballymoney"},1,{"$f":"IF(AwayTeam!H16=\"\",\"\",AwayTeam!H16)","v":"Joe Colley"},null,24.16,3,{"$f":"CalcPoints(G71)","v":2}]
[8,null,3,{"$f":"IF(AwayTeam!I16=\"\",\"\",AwayTeam!I16)","v":"James Green"},null,21.96,1,{"$f":"CalcPoints(G72)","v":4}]
["B",null,5,{"$f":"IF(AwayTeam!J16=\"\",\"\",AwayTeam!J16)","v":""},null,null,null,{"$f":"CalcPoints(G73)","v":""}]
["BOYS",{"$f":"HomeTeam!$C$4","v":"Lecale"},2,{"$f":"IF(HomeTeam!H15=\"\",\"\",HomeTeam!H15)","v":"Tom Costello"},null,27.16,4,null,{"$f":"CalcPoints(G74)","v":1}]
[null,null,4,{"$f":"IF(HomeTeam!I15=\"\",\"\",HomeTeam!I15)","v":"Niall Mc Cauley"},null,23.25,2,null,{"$f":"CalcPoints(G75)","v":3}]
[null,null,6,{"$f":"IF(HomeTeam!J15=\"\",\"\",HomeTeam!J15)","v":"Micheal Uhomobhi"},null,28.53,5,null,{"$f":"CalcPoints(G76)","v":""}]
[null,{"$f":"AwayTeam!$C$4","v":"Ballymoney"},1,{"$f":"IF(AwayTeam!C18=\"\",\"\",AwayTeam!C18)","v":"Chloe Nicholl"},null,23.45,4,{"$f":"CalcPoints(G77)","v":1}]
[9,null,3,{"$f":"IF(AwayTeam!D18=\"\",\"\",AwayTeam!D18)","v":"Molly Atchison"},null,20.03,1,{"$f":"CalcPoints(G78)","v":4}]
["C",null,5,{"$f":"IF(AwayTeam!E18=\"\",\"\",AwayTeam!E18)","v":"Izzi Pollock-Quinn"},null,29,5,{"$f":"CalcPoints(G79)","v":""}]
["GIRLS",{"$f":"HomeTeam!$C$4","v":"Lecale"},2,{"$f":"IF(HomeTeam!C16=\"\",\"\",HomeTeam!C16)","v":"Ellen Doran"},null,21.93,3,null,{"$f":"CalcPoints(G80)","v":2}]
[null,null,4,{"$f":"IF(HomeTeam!D16=\"\",\"\",HomeTeam!D16)","v":"Amy Quinn"},null,20.84,2,null,{"$f":"CalcPoints(G81)","v":3}]
[null,null,6,{"$f":"IF(HomeTeam!E16=\"\",\"\",HomeTeam!E16)","v":""},null,null,null,null,{"$f":"CalcPoints(G82)","v":""}]
[null,{"$f":"AwayTeam!$C$4","v":"Ballymoney"},1,{"$f":"IF(AwayTeam!H18=\"\",\"\",AwayTeam!H18)","v":"Reece Doherty"},null,21.12,1,{"$f":"CalcPoints(G83)","v":4}]
[10,null,3,{"$f":"IF(AwayTeam!I18=\"\",\"\",AwayTeam!I18)","v":"Alfie McFaull"},null,22.94,4,{"$f":"CalcPoints(G84)","v":1}]
["C",null,5,{"$f":"IF(AwayTeam!J18=\"\",\"\",AwayTeam!J18)","v":""},null,null,null,{"$f":"CalcPoints(G85)","v":""}]
["BOYS",{"$f":"HomeTeam!$C$4","v":"Lecale"},2,{"$f":"IF(HomeTeam!H16=\"\",\"\",HomeTeam!H16)","v":"Thomas Nay"},null,23.5,2,null,{"$f":"CalcPoints(G86)","v":3}]
[null,null,4,{"$f":"IF(HomeTeam!I16=\"\",\"\",HomeTeam!I16)","v":"Ben Murtagh"},null,24.72,5,null,{"$f":"CalcPoints(G87)","v":""}]
[null,null,6,{"$f":"IF(HomeTeam!J16=\"\",\"\",HomeTeam!J16)","v":"Noah Sheridan"},null,23.54,3,null,{"$f":"CalcPoints(G88)","v":2}]
[null,{"$f":"AwayTeam!$C$4","v":"Ballymoney"},1,{"$f":"IF(AwayTeam!C20=\"\",\"\",AwayTeam!C20)","v":"Jessica Dunlop"},null,22.45,5,{"$f":"CalcPoints(G89)","v":""}]
[11,null,3,{"$f":"IF(AwayTeam!D20=\"\",\"\",AwayTeam!D20)","v":"Tea McWilliam"},null,19.5,1,{"$f":"CalcPoints(G90)","v":4}]
["D",null,5,{"$f":"IF(AwayTeam!E20=\"\",\"\",AwayTeam!E20)","v":"Leah Scullion"},null,21.34,4,{"$f":"CalcPoints(G91)","v":1}]
["GIRLS",{"$f":"HomeTeam!$C$4","v":"Lecale"},2,{"$f":"IF(HomeTeam!C17=\"\",\"\",HomeTeam!C17)","v":"Bebhionn Rogan"},null,20.47,3,null,{"$f":"CalcPoints(G92)","v":2}]
[null,null,4,{"$f":"IF(HomeTeam!D17=\"\",\"\",HomeTeam!D17)","v":"Catriona Clarke"},null,20.22,2,null,{"$f":"CalcPoints(G93)","v":3}]
[null,null,6,{"$f":"IF(HomeTeam!E17=\"\",\"\",HomeTeam!E17)","v":""},null,null,null,null,{"$f":"CalcPoints(G94)","v":""}]
[null,{"$f":"AwayTeam!$C$4","v":"Ballymoney"},1,{"$f":"IF(AwayTeam!H20=\"\",\"\",AwayTeam!H20)","v":"Jamie Watson"},null,23.32,4,{"$f":"CalcPoints(G95)","v":1}]
[12,null,3,{"$f":"IF(AwayTeam!I20=\"\",\"\",AwayTeam!I20)","v":"Angus Loughridge"},null,22.06,3,{"$f":"CalcPoints(G96)","v":2}]
["D",null,5,{"$f":"IF(AwayTeam!J20=\"\",\"\",AwayTeam!J20)","v":""},null,null,null,{"$f":"CalcPoints(G97)","v":""}]
["BOYS",{"$f":"HomeTeam!$C$4","v":"Lecale"},2,{"$f":"IF(HomeTeam!H17=\"\",\"\",HomeTeam!H17)","v":"Christopher Mason"},null,20.63,2,null,{"$f":"CalcPoints(G98)","v":3}]
[null,null,4,{"$f":"IF(HomeTeam!I17=\"\",\"\",HomeTeam!I17)","v":"Adam Colgan"},null,17.190000000000001,1,null,{"$f":"CalcPoints(G99)","v":4}]
[null,null,6,{"$f":"IF(HomeTeam!J17=\"\",\"\",HomeTeam!J17)","v":"Tom Mc Cormack"},null,null,null,null,{"$f":"CalcPoints(G100)","v":""}]
[null,null,null,null,null,null,"Sub tot",{"$f":"IF(SUM(H95:H97,H89:H91,H83:H85,H77:H79,H71:H73,H65:H67,H59:H61,H53:H55)=0,\"\",SUM(H95:H97,H89:H91,H83:H85,H77:H79,H71:H73,H65:H67,H59:H61,H53:H55))","v":37},{"$f":"IF(SUM(I98:I100,I92:I94,I86:I88,I80:I82,I74:I76,I68:I70,I62:I64,I56:I58)=0,\"\",SUM(I98:I100,I92:I94,I86:I88,I80:I82,I74:I76,I68:I70,I62:I64,I56:I58))","v":43}]
[null,null,null,null,null,null,"B/F tot",{"$f":"H48","v":16},{"$f":"I48","v":24}]
[null,null,null,null,null,null,"Total ",{"$f":"IF(SUM(H101:H102)=0,\"\",SUM(H101:H102))","v":53},{"$f":"IF(SUM(I101:I102)=0,\"\",SUM(I101:I102))","v":67}]
[]
["BREASTSTROKE"]
[]
["Event","Club","Lane","Swimmer",null,"Time","Place","Points"]
[null,{"$f":"AwayTeam!$C$4","v":"Ballymoney"},1,{"$f":"IF(AwayTeam!C21=\"\",\"\",AwayTeam!C21)","v":"Leanne Balmer"},null,35.659999999999997,4,{"$f":"CalcPoints(G108)","v":1}]
[13,null,3,{"$f":"IF(AwayTeam!D21=\"\",\"\",AwayTeam!D21)","v":"Jayne McNeill"},null,30.86,1,{"$f":"CalcPoints(G109)","v":4}]
["A",null,5,{"$f":"IF(AwayTeam!E21=\"\",\"\",AwayTeam!E21)","v":"Erin Murray"},null,46.62,5,{"$f":"CalcPoints(G110)","v":""}]
["GIRLS",{"$f":"HomeTeam!$C$4","v":"Lecale"},2,{"$f":"IF(HomeTeam!C18=\"\",\"\",HomeTeam!C18)","v":"Essie Costello"},null,31.68,2,null,{"$f":"CalcPoints(G111)","v":3}]
[null,null,4,{"$f":"IF(HomeTeam!D18=\"\",\"\",HomeTeam!D18)","v":"Enya Clarke"},null,31.85,3,null,{"$f":"CalcPoints(G112)","v":2}]
[null,null,6,{"$f":"IF(HomeTeam!E18=\"\",\"\",HomeTeam!E18)","v":""},null,null,null,null,{"$f":"CalcPoints(G113)","v":""}]
[null,{"$f":"AwayTeam!$C$4","v":"Ballymoney"},1,{"$f":"IF(AwayTeam!H21=\"\",\"\",AwayTeam!H21)","v":"Harris Fleming"},null,28.81,1,{"$f":"CalcPoints(G114)","v":4}]
[14,null,3,{"$f":"IF(AwayTeam!I21=\"\",\"\",AwayTeam!I21)","v":"Matthew Nicholl"},null,41.31,4,{"$f":"CalcPoints(G115)","v":1}]
["A",null,5,{"$f":"IF(AwayTeam!J21=\"\",\"\",AwayTeam!J21)","v":""},null,null,null,{"$f":"CalcPoints(G116)","v":""}]
["BOYS",{"$f":"HomeTeam!$C$4","v":"Lecale"},2,{"$f":"IF(HomeTeam!H18=\"\",\"\",HomeTeam!H18)","v":"Mark Knight"},null,37.44,3,null,{"$f":"CalcPoints(G117)","v":2}]
[null,null,4,{"$f":"IF(HomeTeam!I18=\"\",\"\",HomeTeam!I18)","v":"Henry Costello"},null,32.28,2,null,{"$f":"CalcPoints(G118)","v":3}]
[null,null,6,{"$f":"IF(HomeTeam!J18=\"\",\"\",HomeTeam!J18)","v":"Lucas O'Neill"},null,37.54,null,null,{"$f":"CalcPoints(G119)","v":""}]
[null,{"$f":"AwayTeam!$C$4","v":"Ballymoney"},1,{"$f":"IF(AwayTeam!C22=\"\",\"\",AwayTeam!C22)","v":"Daisy Dunlop"},null,33.81,4,{"$f":"CalcPoints(G120)","v":1}]
[15,null,3,{"$f":"IF(AwayTeam!D22=\"\",\"\",AwayTeam!D22)","v":"Sophie McCormick"},null,30.09,3,{"$f":"CalcPoints(G121)","v":2}]
["B",null,5,{"$f":"IF(AwayTeam!E22=\"\",\"\",AwayTeam!E22)","v":"Leah Atkinson"},null,35.75,5,{"$f":"CalcPoints(G122)","v":""}]
["GIRLS",{"$f":"HomeTeam!$C$4","v":"Lecale"},2,{"$f":"IF(HomeTeam!C19=\"\",\"\",HomeTeam!C19)","v":"Charlotte Savage"},null,27.27,2,null,{"$f":"CalcPoints(G123)","v":3}]
[null,null,4,{"$f":"IF(HomeTeam!D19=\"\",\"\",HomeTeam!D19)","v":"Olivia Miskelly"},null,24.5,1,null,{"$f":"CalcPoints(G124)","v":4}]
[null,null,6,{"$f":"IF(HomeTeam!E19=\"\",\"\",HomeTeam!E19)","v":""},null,null,null,null,{"$f":"CalcPoints(G125)","v":""}]
[null,{"$f":"AwayTeam!$C$4","v":"Ballymoney"},1,{"$f":"IF(AwayTeam!H22=\"\",\"\",AwayTeam!H22)","v":"Joe Colley"},null,24.86,2,{"$f":"CalcPoints(G126)","v":3}]
[16,null,3,{"$f":"IF(AwayTeam!I22=\"\",\"\",AwayTeam!I22)","v":".James Green"},null,22.37,1,{"$f":"CalcPoints(G127)","v":4}]
["B",null,5,{"$f":"IF(AwayTeam!J22=\"\",\"\",AwayTeam!J22)","v":""},null,null,null,{"$f":"CalcPoints(G128)","v":""}]
["BOYS",{"$f":"HomeTeam!$C$4","v":"Lecale"},2,{"$f":"IF(HomeTeam!H19=\"\",\"\",HomeTeam!H19)","v":"Tom Costello"},null,29.02,4,null,{"$f":"CalcPoints(G129)","v":1}]
[null,null,4,{"$f":"IF(HomeTeam!I19=\"\",\"\",HomeTeam!I19)","v":"Niall Mc Cauley"},null,25.57,3,null,{"$f":"CalcPoints(G130)","v":2}]
[null,null,6,{"$f":"IF(HomeTeam!J19=\"\",\"\",HomeTeam!J19)","v":"Micheal Uhomobhi"},null,31.75,5,null,{"$f":"CalcPoints(G131)","v":""}]
[null,{"$f":"AwayTeam!$C$4","v":"Ballymoney"},1,{"$f":"IF(AwayTeam!C23=\"\",\"\",AwayTeam!C23)","v":"Chloe Nicholl"},null,26.82,3,{"$f":"CalcPoints(G132)","v":2}]
[17,null,3,{"$f":"IF(AwayTeam!D23=\"\",\"\",AwayTeam!D23)","v":"Molly Atchison"},null,22.53,1,{"$f":"CalcPoints(G133)","v":4}]
["C",null,5,{"$f":"IF(AwayTeam!E23=\"\",\"\",AwayTeam!E23)","v":"Faye Dempsey"},null,29.22,5,{"$f":"CalcPoints(G134)","v":""}]
["GIRLS",{"$f":"HomeTeam!$C$4","v":"Lecale"},2,{"$f":"IF(HomeTeam!C20=\"\",\"\",HomeTeam!C20)","v":"Amy Quinn"},null,27.42,4,null,{"$f":"CalcPoints(G135)","v":1}]
[null,null,4,{"$f":"IF(HomeTeam!D20=\"\",\"\",HomeTeam!D20)","v":"Emily Burns"},null,26.81,2,null,{"$f":"CalcPoints(G136)","v":3}]
[null,null,6,{"$f":"IF(HomeTeam!E20=\"\",\"\",HomeTeam!E20)","v":""},null,null,null,null,{"$f":"CalcPoints(G137)","v":""}]
[null,{"$f":"AwayTeam!$C$4","v":"Ballymoney"},1,{"$f":"IF(AwayTeam!H23=\"\",\"\",AwayTeam!H23)","v":"Reece Doherty"},null,31.12,4,{"$f":"CalcPoints(G138)","v":1}]
[18,null,3,{"$f":"IF(AwayTeam!I23=\"\",\"\",AwayTeam!I23)","v":"Alfie McFaull"},null,22.78,1,{"$f":"CalcPoints(G139)","v":4}]
["C",null,5,{"$f":"IF(AwayTeam!J23=\"\",\"\",AwayTeam!J23)","v":""},null,null,null,{"$f":"CalcPoints(G140)","v":""}]
["BOYS",{"$f":"HomeTeam!$C$4","v":"Lecale"},2,{"$f":"IF(HomeTeam!H20=\"\",\"\",HomeTeam!H20)","v":"Thomas Nay"},null,26.53,2,null,{"$f":"CalcPoints(G141)","v":3}]
[null,null,4,{"$f":"IF(HomeTeam!I20=\"\",\"\",HomeTeam!I20)","v":"Noah Sheridan"},null,26.84,3,null,{"$f":"CalcPoints(G142)","v":2}]
[null,null,6,{"$f":"IF(HomeTeam!J20=\"\",\"\",HomeTeam!J20)","v":"Ben Murtagh"},null,29.78,null,null,{"$f":"CalcPoints(G143)","v":""}]
[null,{"$f":"AwayTeam!$C$4","v":"Ballymoney"},1,{"$f":"IF(AwayTeam!C24=\"\",\"\",AwayTeam!C24)","v":"Jessica Dunlop"},null,26.25,5,{"$f":"CalcPoints(G144)","v":""}]
[19,null,3,{"$f":"IF(AwayTeam!D24=\"\",\"\",AwayTeam!D24)","v":"Tea McWilliam"},null,23.32,3,{"$f":"CalcPoints(G145)","v":2}]
["D",null,5,{"$f":"IF(AwayTeam!E24=\"\",\"\",AwayTeam!E24)","v":"Leah Scullion"},null,24.36,4,{"$f":"CalcPoints(G146)","v":1}]
["GIRLS",{"$f":"HomeTeam!$C$4","v":"Lecale"},2,{"$f":"IF(HomeTeam!C21=\"\",\"\",HomeTeam!C21)","v":"Alicia Dobbin"},null,21.9,1,null,{"$f":"CalcPoints(G147)","v":4}]
[null,null,4,{"$f":"IF(HomeTeam!D21=\"\",\"\",HomeTeam!D21)","v":"Kiera Knight"},null,22.28,2,null,{"$f":"CalcPoints(G148)","v":3}]
[null,null,6,{"$f":"IF(HomeTeam!E21=\"\",\"\",HomeTeam!E21)","v":""},null,null,null,null,{"$f":"CalcPoints(G149)","v":""}]
[null,{"$f":"AwayTeam!$C$4","v":"Ballymoney"},1,{"$f":"IF(AwayTeam!H24=\"\",\"\",AwayTeam!H24)","v":"Jamie Watson"},null,25.54,3,{"$f":"CalcPoints(G150)","v":2}]
[20,null,3,{"$f":"IF(AwayTeam!I24=\"\",\"\",AwayTeam!I24)","v":"Jack Dempsey"},null,25.75,4,{"$f":"CalcPoints(G151)","v":1}]
["D",null,5,{"$f":"IF(AwayTeam!J24=\"\",\"\",AwayTeam!J24)","v":""},null,null,null,{"$f":"CalcPoints(G152)","v":""}]
["BOYS",{"$f":"HomeTeam!$C$4","v":"Lecale"},2,{"$f":"IF(HomeTeam!H21=\"\",\"\",HomeTeam!H21)","v":"Christopher Mason"},null,23.34,null,null,{"$f":"CalcPoints(G153)","v":""}]
[null,null,4,{"$f":"IF(HomeTeam!I21=\"\",\"\",HomeTeam!I21)","v":"Adam Colgan"},null,19.75,1,null,{"$f":"CalcPoints(G154)","v":4}]
[null,null,6,{"$f":"IF(HomeTeam!J21=\"\",\"\",HomeTeam!J21)","v":"Tom Mc Cormack"},null,23.28,2,null,{"$f":"CalcPoints(G155)","v":3}]
[null,null,null,null,null,null,"Sub tot",{"$f":"IF(SUM(H150:H152,H144:H146,H138:H140,H132:H134,H126:H128,H120:H122,H114:H116,H108:H110)=0,\"\",SUM(H150:H152,H144:H146,H138:H140,H132:H134,H126:H128,H120:H122,H114:H116,H108:H110))","v":37},{"$f":"IF(SUM(I153:I155,I147:I149,I141:I143,I135:I137,I129:I131,I123:I125,I117:I119,I111:I113)=0,\"\",SUM(I153:I155,I147:I149,I141:I143,I135:I137,I129:I131,I123:I125,I117:I119,I111:I113))","v":43}]
[null,null,null,null,null,null,"B/F tot",{"$f":"H103","v":53},{"$f":"I103","v":67}]
[null,null,null,null,null,null,"Total ",{"$f":"IF(SUM(H156:H157)=0,\"\",SUM(H156:H157))","v":90},{"$f":"IF(SUM(I156:I157)=0,\"\",SUM(I156:I157))","v":110}]
[]
["BUTTERFLY"]
[]
["Event","Club","Lane","Swimmer",null,"Time","Place","Points"]
[null,{"$f":"AwayTeam!$C$4","v":"Ballymoney"},1,{"$f":"IF(AwayTeam!C25=\"\",\"\",AwayTeam!C25)","v":"Leanne Balmer"},null,35.28,4,{"$f":"CalcPoints(G163)","v":1}]
[21,null,3,{"$f":"IF(AwayTeam!D25=\"\",\"\",AwayTeam!D25)","v":"Jayne McNeill"},null,25.96,1,{"$f":"CalcPoints(G164)","v":4}]
["A",null,5,{"$f":"IF(AwayTeam!E25=\"\",\"\",AwayTeam!E25)","v":"Erin Murray"},null,43.5,5,{"$f":"CalcPoints(G165)","v":""}]
["GIRLS",{"$f":"HomeTeam!$C$4","v":"Lecale"},2,{"$f":"IF(HomeTeam!C22=\"\",\"\",HomeTeam!C22)","v":"Essie Costello"},null,32.479999999999997,3,null,{"$f":"CalcPoints(G166)","v":2}]
[null,null,4,{"$f":"IF(HomeTeam!D22=\"\",\"\",HomeTeam!D22)","v":"Enya Clarke"},null,29.03,2,null,{"$f":"CalcPoints(G167)","v":3}]
[null,null,6,{"$f":"IF(HomeTeam!E22=\"\",\"\",HomeTeam!E22)","v":""},null,null,null,null,{"$f":"CalcPoints(G168)","v":""}]
[null,{"$f":"AwayTeam!$C$4","v":"Ballymoney"},1,{"$f":"IF(AwayTeam!H25=\"\",\"\",AwayTeam!H25)","v":"Harris Fleming"},null,30.09,2,{"$f":"CalcPoints(G169)","v":3}]
[22,null,3,{"$f":"IF(AwayTeam!I25=\"\",\"\",AwayTeam!I25)","v":"Matthew Nicholl"},null,32.56,4,{"$f":"CalcPoints(G170)","v":1}]
["A",null,5,{"$f":"IF(AwayTeam!J25=\"\",\"\",AwayTeam!J25)","v":""},null,null,null,{"$f":"CalcPoints(G171)","v":""}]
["BOYS",{"$f":"HomeTeam!$C$4","v":"Lecale"},2,{"$f":"IF(HomeTeam!H22=\"\",\"\",HomeTeam!H22)","v":"Mark Knight"},null,32.06,3,null,{"$f":"CalcPoints(G172)","v":2}]
[null,null,4,{"$f":"IF(HomeTeam!I22=\"\",\"\",HomeTeam!I22)","v":"Henry Costello"},null,29.91,1,null,{"$f":"CalcPoints(G173)","v":4}]
[null,null,6,{"$f":"IF(HomeTeam!J22=\"\",\"\",HomeTeam!J22)","v":"Cormac Byrne"},null,32.78,5,null,{"$f":"CalcPoints(G174)","v":""}]
[null,{"$f":"AwayTeam!$C$4","v":"Ballymoney"},1,{"$f":"IF(AwayTeam!C26=\"\",\"\",AwayTeam!C26)","v":"Daisy Dunlop"},null,37.700000000000003,4,{"$f":"CalcPoints(G175)","v":1}]
[23,null,3,{"$f":"IF(AwayTeam!D26=\"\",\"\",AwayTeam!D26)","v":"Sophie McCormick"},null,21.59,2,{"$f":"CalcPoints(G176)","v":3}]
["B",null,5,{"$f":"IF(AwayTeam!E26=\"\",\"\",AwayTeam!E26)","v":"Rachael Hill"},null,38,5,{"$f":"CalcPoints(G177)","v":""}]
["GIRLS",{"$f":"HomeTeam!$C$4","v":"Lecale"},2,{"$f":"IF(HomeTeam!C23=\"\",\"\",HomeTeam!C23)","v":"Charlotte Savage"},null,22.56,3,null,{"$f":"CalcPoints(G178)","v":2}]
[null,null,4,{"$f":"IF(HomeTeam!D23=\"\",\"\",HomeTeam!D23)","v":"Olivia Miskelly"},null,20.420000000000002,1,null,{"$f":"CalcPoints(G179)","v":4}]
[null,null,6,{"$f":"IF(HomeTeam!E23=\"\",\"\",HomeTeam!E23)","v":""},null,null,null,null,{"$f":"CalcPoints(G180)","v":""}]
[null,{"$f":"AwayTeam!$C$4","v":"Ballymoney"},1,{"$f":"IF(AwayTeam!H26=\"\",\"\",AwayTeam!H26)","v":"Joe Colley"},null,24.66,3,{"$f":"CalcPoints(G181)","v":2}]
[24,null,3,{"$f":"IF(AwayTeam!I26=\"\",\"\",AwayTeam!I26)","v":"James Green"},null,21.63,1,{"$f":"CalcPoints(G182)","v":4}]
["B",null,5,{"$f":"IF(AwayTeam!J26=\"\",\"\",AwayTeam!J26)","v":""},null,null,null,{"$f":"CalcPoints(G183)","v":""}]
["BOYS",{"$f":"HomeTeam!$C$4","v":"Lecale"},2,{"$f":"IF(HomeTeam!H23=\"\",\"\",HomeTeam!H23)","v":"Tom Costello"},null,23.69,2,null,{"$f":"CalcPoints(G184)","v":3}]
[null,null,4,{"$f":"IF(HomeTeam!I23=\"\",\"\",HomeTeam!I23)","v":"Niall Mc Cauley"},null,25.12,4,null,{"$f":"CalcPoints(G185)","v":1}]
[null,null,6,{"$f":"IF(HomeTeam!J23=\"\",\"\",HomeTeam!J23)","v":"Micheal Uhomobhi"},null,32.22,5,null,{"$f":"CalcPoints(G186)","v":""}]
[null,{"$f":"AwayTeam!$C$4","v":"Ballymoney"},1,{"$f":"IF(AwayTeam!C27=\"\",\"\",AwayTeam!C27)","v":"Chloe Nicholl"},null,26.66,4,{"$f":"CalcPoints(G187)","v":1}]
[25,null,3,{"$f":"IF(AwayTeam!D27=\"\",\"\",AwayTeam!D27)","v":"Molly Atchison"},null,19.43,1,{"$f":"CalcPoints(G188)","v":4}]
["C",null,5,{"$f":"IF(AwayTeam!E27=\"\",\"\",AwayTeam!E27)","v":"Izzi Pollock-Quinn"},null,34.19,5,{"$f":"CalcPoints(G189)","v":""}]
["GIRLS",{"$f":"HomeTeam!$C$4","v":"Lecale"},2,{"$f":"IF(HomeTeam!C24=\"\",\"\",HomeTeam!C24)","v":"Emily Burns"},null,20.420000000000002,3,null,{"$f":"CalcPoints(G190)","v":2}]
[null,null,4,{"$f":"IF(HomeTeam!D24=\"\",\"\",HomeTeam!D24)","v":"Amy Quinn"},null,19.78,2,null,{"$f":"CalcPoints(G191)","v":3}]
[null,null,6,{"$f":"IF(HomeTeam!E24=\"\",\"\",HomeTeam!E24)","v":""},null,null,null,null,{"$f":"CalcPoints(G192)","v":""}]
[null,{"$f":"AwayTeam!$C$4","v":"Ballymoney"},1,{"$f":"IF(AwayTeam!H27=\"\",\"\",AwayTeam!H27)","v":"Reece Doherty"},null,21.91,1,{"$f":"CalcPoints(G193)","v":4}]
[26,null,3,{"$f":"IF(AwayTeam!I27=\"\",\"\",AwayTeam!I27)","v":"Alfie McFaull"},null,22.63,4,{"$f":"CalcPoints(G194)","v":1}]
["C",null,5,{"$f":"IF(AwayTeam!J27=\"\",\"\",AwayTeam!J27)","v":""},null,null,null,{"$f":"CalcPoints(G195)","v":""}]
["BOYS",{"$f":"HomeTeam!$C$4","v":"Lecale"},2,{"$f":"IF(HomeTeam!H24=\"\",\"\",HomeTeam!H24)","v":"Thomas Hanlon"},null,22.59,3,null,{"$f":"CalcPoints(G196)","v":2}]
[null,null,4,{"$f":"IF(HomeTeam!I24=\"\",\"\",HomeTeam!I24)","v":"Thomas Nay"},null,22.25,2,null,{"$f":"CalcPoints(G197)","v":3}]
[null,null,6,{"$f":"IF(HomeTeam!J24=\"\",\"\",HomeTeam!J24)","v":"Noah Sheridan"},null,27.09,5,null,{"$f":"CalcPoints(G198)","v":""}]
[null,{"$f":"AwayTeam!$C$4","v":"Ballymoney"},1,{"$f":"IF(AwayTeam!C28=\"\",\"\",AwayTeam!C28)","v":"Jessica Dunlop"},null,21.36,5,{"$f":"CalcPoints(G199)","v":""}]
[27,null,3,{"$f":"IF(AwayTeam!D28=\"\",\"\",AwayTeam!D28)","v":"Tea McWilliam"},null,18.16,2,{"$f":"CalcPoints(G200)","v":3}]
["D",null,5,{"$f":"IF(AwayTeam!E28=\"\",\"\",AwayTeam!E28)","v":"Lucy Maguire"},null,21.5,4,{"$f":"CalcPoints(G201)","v":1}]
["GIRLS",{"$f":"HomeTeam!$C$4","v":"Lecale"},2,{"$f":"IF(HomeTeam!C25=\"\",\"\",HomeTeam!C25)","v":"Bebhionn Rogan"},null,17.5,1,null,{"$f":"CalcPoints(G202)","v":4}]
[null,null,4,{"$f":"IF(HomeTeam!D25=\"\",\"\",HomeTeam!D25)","v":"Catriona Clarke"},null,18.66,3,null,{"$f":"CalcPoints(G203)","v":2}]
[null,null,6,{"$f":"IF(HomeTeam!E25=\"\",\"\",HomeTeam!E25)","v":""},null,null,null,null,{"$f":"CalcPoints(G204)","v":""}]
[null,{"$f":"AwayTeam!$C$4","v":"Ballymoney"},1,{"$f":"IF(AwayTeam!H28=\"\",\"\",AwayTeam!H28)","v":"Jamie Watson"},null,26.2,4,{"$f":"CalcPoints(G205)","v":1}]
[28,null,3,{"$f":"IF(AwayTeam!I28=\"\",\"\",AwayTeam!I28)","v":"Angus Loughridge"},null,24.75,3,{"$f":"CalcPoints(G206)","v":2}]
["D",null,5,{"$f":"IF(AwayTeam!J28=\"\",\"\",AwayTeam!J28)","v":""},null,null,null,{"$f":"CalcPoints(G207)","v":""}]
["BOYS",{"$f":"HomeTeam!$C$4","v":"Lecale"},2,{"$f":"IF(HomeTeam!H25=\"\",\"\",HomeTeam!H25)","v":"Tom Mc Cormack"},null,20.28,2,null,{"$f":"CalcPoints(G208)","v":3}]
[null,null,4,{"$f":"IF(HomeTeam!I25=\"\",\"\",HomeTeam!I25)","v":"Adam Colgan"},null,15.72,1,null,{"$f":"CalcPoints(G209)","v":4}]
[null,null,6,{"$f":"IF(HomeTeam!J25=\"\",\"\",HomeTeam!J25)","v":"Christopher Mason"},null,21.34,null,null,{"$f":"CalcPoints(G210)","v":""}]
[null,null,null,null,null,null,"Sub tot",{"$f":"IF(SUM(H205:H207,H199:H201,H193:H195,H187:H189,H181:H183,H175:H177,H169:H171,H163:H165)=0,\"\",SUM(H205:H207,H199:H201,H193:H195,H187:H189,H181:H183,H175:H177,H169:H171,H163:H165))","v":36},{"$f":"IF(SUM(I208:I210,I202:I204,I196:I198,I190:I192,I184:I186,I178:I180,I172:I174,I166:I168)=0,\"\",SUM(I208:I210,I202:I204,I196:I198,I190:I192,I184:I186,I178:I180,I172:I174,I166:I168))","v":44}]
[null,null,null,null,null,null,"B/F tot",{"$f":"H158","v":90},{"$f":"I158","v":110}]
[null,null,null,null,null,null,"Total ",{"$f":"IF(SUM(H211:H212)=0,\"\",SUM(H211:H212))","v":126},{"$f":"IF(SUM(I211:I212)=0,\"\",SUM(I211:I212))","v":154}]
[]
["FREESTYLE"]
[]
["Event","Club","Lane","Swimmer",null,"Time","Place","Points"]
[null,{"$f":"AwayTeam!$C$4","v":"Ballymoney"},1,{"$f":"IF(AwayTeam!C29=\"\",\"\",AwayTeam!C29)","v":"Leanne Balmer"},null,27,3,{"$f":"CalcPoints(G218)","v":2}]
[29,null,3,{"$f":"IF(AwayTeam!D29=\"\",\"\",AwayTeam!D29)","v":"Jayne McNeill"},null,22.4,1,{"$f":"CalcPoints(G219)","v":4}]
["A",null,5,{"$f":"IF(AwayTeam!E29=\"\",\"\",AwayTeam!E29)","v":"Erin Murray"},null,35.97,5,{"$f":"CalcPoints(G220)","v":""}]
["GIRLS",{"$f":"HomeTeam!$C$4","v":"Lecale"},2,{"$f":"IF(HomeTeam!C26=\"\",\"\",HomeTeam!C26)","v":"Essie Costello "},null,28.25,4,null,{"$f":"CalcPoints(G221)","v":1}]
[null,null,4,{"$f":"IF(HomeTeam!D26=\"\",\"\",HomeTeam!D26)","v":"Enya Clarke"},null,23.25,2,null,{"$f":"CalcPoints(G222)","v":3}]
[null,null,6,{"$f":"IF(HomeTeam!E26=\"\",\"\",HomeTeam!E26)","v":""},null,null,null,null,{"$f":"CalcPoints(G223)","v":""}]
[null,{"$f":"AwayTeam!$C$4","v":"Ballymoney"},1,{"$f":"IF(AwayTeam!H29=\"\",\"\",AwayTeam!H29)","v":"Harris Fleming"},null,23.16,2,{"$f":"CalcPoints(G224)","v":3}]
[30,null,3,{"$f":"IF(AwayTeam!I29=\"\",\"\",AwayTeam!I29)","v":"Matthew Nicholl"},null,25.19,4,{"$f":"CalcPoints(G225)","v":1}]
["A",null,5,{"$f":"IF(AwayTeam!J29=\"\",\"\",AwayTeam!J29)","v":""},null,null,null,{"$f":"CalcPoints(G226)","v":""}]
["BOYS",{"$f":"HomeTeam!$C$4","v":"Lecale"},2,{"$f":"IF(HomeTeam!H26=\"\",\"\",HomeTeam!H26)","v":"Mark Knight"},null,25.02,3,null,{"$f":"CalcPoints(G227)","v":2}]
[null,null,4,{"$f":"IF(HomeTeam!I26=\"\",\"\",HomeTeam!I26)","v":"Henry Costello"},null,21,1,null,{"$f":"CalcPoints(G228)","v":4}]
[null,null,6,{"$f":"IF(HomeTeam!J26=\"\",\"\",HomeTeam!J26)","v":"Lucas O'Neill"},null,28.97,5,null,{"$f":"CalcPoints(G229)","v":""}]
[null,{"$f":"AwayTeam!$C$4","v":"Ballymoney"},1,{"$f":"IF(AwayTeam!C31=\"\",\"\",AwayTeam!C31)","v":"Daisy Dunlop"},null,28.91,4,{"$f":"CalcPoints(G230)","v":1}]
[31,null,3,{"$f":"IF(AwayTeam!D31=\"\",\"\",AwayTeam!D31)","v":"Sophie McCormick"},null,20.34,3,{"$f":"CalcPoints(G231)","v":2}]
["B",null,5,{"$f":"IF(AwayTeam!E31=\"\",\"\",AwayTeam!E31)","v":"Leah Atkinson"},null,31.13,5,{"$f":"CalcPoints(G232)","v":""}]
["GIRLS",{"$f":"HomeTeam!$C$4","v":"Lecale"},2,{"$f":"IF(HomeTeam!C27=\"\",\"\",HomeTeam!C27)","v":"Charlotte Savage"},null,19.649999999999999,2,null,{"$f":"CalcPoints(G233)","v":3}]
[null,null,4,{"$f":"IF(HomeTeam!D27=\"\",\"\",HomeTeam!D27)","v":"Olivia Miskelly"},null,16.850000000000001,1,null,{"$f":"CalcPoints(G234)","v":4}]
[null,null,6,{"$f":"IF(HomeTeam!E27=\"\",\"\",HomeTeam!E27)","v":""},null,null,null,null,{"$f":"CalcPoints(G235)","v":""}]
[null,{"$f":"AwayTeam!$C$4","v":"Ballymoney"},1,{"$f":"IF(AwayTeam!H31=\"\",\"\",AwayTeam!H31)","v":"Joe Colley"},null,19.48,3,{"$f":"CalcPoints(G236)","v":2}]
[32,null,3,{"$f":"IF(AwayTeam!I31=\"\",\"\",AwayTeam!I31)","v":"James Green"},null,18.88,2,{"$f":"CalcPoints(G237)","v":3}]
["B",null,5,{"$f":"IF(AwayTeam!J31=\"\",\"\",AwayTeam!J31)","v":""},null,null,null,{"$f":"CalcPoints(G238)","v":""}]
["BOYS",{"$f":"HomeTeam!$C$4","v":"Lecale"},2,{"$f":"IF(HomeTeam!H27=\"\",\"\",HomeTeam!H27)","v":"Tom Costello"},null,20.149999999999999,4,null,{"$f":"CalcPoints(G239)","v":1}]
[null,null,4,{"$f":"IF(HomeTeam!I27=\"\",\"\",HomeTeam!I27)","v":"Niall Mc Cauley"},null,17.809999999999999,1,null,{"$f":"CalcPoints(G240)","v":4}]
[null,null,6,{"$f":"IF(HomeTeam!J27=\"\",\"\",HomeTeam!J27)","v":"Micheal Uhomobhi"},null,21.12,5,null,{"$f":"CalcPoints(G241)","v":""}]
[null,{"$f":"AwayTeam!$C$4","v":"Ballymoney"},1,{"$f":"IF(AwayTeam!C33=\"\",\"\",AwayTeam!C33)","v":"Chloe Nicholl"},null,19.73,4,{"$f":"CalcPoints(G242)","v":1}]
[33,null,3,{"$f":"IF(AwayTeam!D33=\"\",\"\",AwayTeam!D33)","v":"Molly Atchison"},null,16.940000000000001,1,{"$f":"CalcPoints(G243)","v":4}]
["C",null,5,{"$f":"IF(AwayTeam!E33=\"\",\"\",AwayTeam!E33)","v":"Faye Dempsey"},null,20.65,5,{"$f":"CalcPoints(G244)","v":""}]
["GIRLS",{"$f":"HomeTeam!$C$4","v":"Lecale"},2,{"$f":"IF(HomeTeam!C28=\"\",\"\",HomeTeam!C28)","v":"Emily Burns"},null,18.88,3,null,{"$f":"CalcPoints(G245)","v":2}]
[null,null,4,{"$f":"IF(HomeTeam!D28=\"\",\"\",HomeTeam!D28)","v":"Amy Quinn"},null,17.649999999999999,2,null,{"$f":"CalcPoints(G246)","v":3}]
[null,null,6,{"$f":"IF(HomeTeam!E28=\"\",\"\",HomeTeam!E28)","v":""},null,null,null,null,{"$f":"CalcPoints(G247)","v":""}]
[null,{"$f":"AwayTeam!$C$4","v":"Ballymoney"},1,{"$f":"IF(AwayTeam!H33=\"\",\"\",AwayTeam!H33)","v":"Reece Doherty"},null,18.02,2,{"$f":"CalcPoints(G248)","v":3}]
[34,null,3,{"$f":"IF(AwayTeam!I33=\"\",\"\",AwayTeam!I33)","v":"Alfie McFaull"},null,19.43,4,{"$f":"CalcPoints(G249)","v":1}]
["C",null,5,{"$f":"IF(AwayTeam!J33=\"\",\"\",AwayTeam!J33)","v":""},null,null,null,{"$f":"CalcPoints(G250)","v":""}]
["BOYS",{"$f":"HomeTeam!$C$4","v":"Lecale"},2,{"$f":"IF(HomeTeam!H28=\"\",\"\",HomeTeam!H28)","v":"Noah Sheridan"},null,18.559999999999999,3,null,{"$f":"CalcPoints(G251)","v":2}]
[null,null,4,{"$f":"IF(HomeTeam!I28=\"\",\"\",HomeTeam!I28)","v":"Thomas Hanlon"},null,17.84,1,null,{"$f":"CalcPoints(G252)","v":4}]
[null,null,6,{"$f":"IF(HomeTeam!J28=\"\",\"\",HomeTeam!J28)","v":"Ben Murtagh"},null,21.53,5,null,{"$f":"CalcPoints(G253)","v":""}]
[null,{"$f":"AwayTeam!$C$4","v":"Ballymoney"},1,{"$f":"IF(AwayTeam!C35=\"\",\"\",AwayTeam!C35)","v":"Jessica Dunlop"},null,18.88,5,{"$f":"CalcPoints(G254)","v":""}]
[35,null,3,{"$f":"IF(AwayTeam!D35=\"\",\"\",AwayTeam!D35)","v":"Tea McWilliam"},null,16.61,1,{"$f":"CalcPoints(G255)","v":4}]
["D",null,5,{"$f":"IF(AwayTeam!E35=\"\",\"\",AwayTeam!E35)","v":"Lucy Maguire"},null,19,4,{"$f":"CalcPoints(G256)","v":1}]
["GIRLS",{"$f":"HomeTeam!$C$4","v":"Lecale"},2,{"$f":"IF(HomeTeam!C29=\"\",\"\",HomeTeam!C29)","v":"Catriona Clarke"},null,17.55,3,null,{"$f":"CalcPoints(G257)","v":2}]
[null,null,4,{"$f":"IF(HomeTeam!D29=\"\",\"\",HomeTeam!D29)","v":"Bebhionn Rogan"},null,16.82,2,null,{"$f":"CalcPoints(G258)","v":3}]
[null,null,6,{"$f":"IF(HomeTeam!E29=\"\",\"\",HomeTeam!E29)","v":""},null,null,null,null,{"$f":"CalcPoints(G259)","v":""}]
[null,{"$f":"AwayTeam!$C$4","v":"Ballymoney"},1,{"$f":"IF(AwayTeam!H35=\"\",\"\",AwayTeam!H35)","v":"Jamie Watson"},null,19.510000000000002,3,{"$f":"CalcPoints(G260)","v":2}]
[36,null,3,{"$f":"IF(AwayTeam!I35=\"\",\"\",AwayTeam!I35)","v":"Jack Dempsey"},null,20.03,4,{"$f":"CalcPoints(G261)","v":1}]
["D",null,5,{"$f":"IF(AwayTeam!J35=\"\",\"\",AwayTeam!J35)","v":""},null,null,null,{"$f":"CalcPoints(G262)","v":""}]
["BOYS",{"$f":"HomeTeam!$C$4","v":"Lecale"},2,{"$f":"IF(HomeTeam!H29=\"\",\"\",HomeTeam!H29)","v":"Tom Mc Cormack"},null,17.09,2,null,{"$f":"CalcPoints(G263)","v":3}]
[null,null,4,{"$f":"IF(HomeTeam!I29=\"\",\"\",HomeTeam!I29)","v":"Adam Colgan"},null,14.62,1,null,{"$f":"CalcPoints(G264)","v":4}]
[null,null,6,{"$f":"IF(HomeTeam!J29=\"\",\"\",HomeTeam!J29)","v":"Christopher Mason"},null,17.13,null,null,{"$f":"CalcPoints(G265)","v":""}]
[null,null,null,null,null,null,"Sub tot",{"$f":"IF(SUM(H260:H262,H254:H256,H248:H250,H242:H244,H236:H238,H230:H232,H224:H226,H218:H220)=0,\"\",SUM(H260:H262,H254:H256,H248:H250,H242:H244,H236:H238,H230:H232,H224:H226,H218:H220))","v":35},{"$f":"IF(SUM(I263:I265,I257:I259,I251:I253,I245:I247,I239:I241,I233:I235,I227:I229,I221:I223)=0,\"\",SUM(I263:I265,I257:I259,I251:I253,I245:I247,I239:I241,I233:I235,I227:I229,I221:I223))","v":45}]
[null,null,null,null,null,null,"B/F tot",{"$f":"H213","v":126},{"$f":"I213","v":154}]
[null,null,null,null,null,null,"Total ",{"$f":"IF(SUM(H266:H267)=0,\"\",SUM(H266:H267))","v":161},{"$f":"IF(SUM(I266:I267)=0,\"\",SUM(I266:I267))","v":199}]
[]
["FREESTYLE TEAM RELAY"]
[]
["Event","Club","Lane","Swimmer",null,"Time","Place","Points"]
[]
[null,{"$f":"AwayTeam!$C$4","v":"Ballymoney"},null,{"$f":"IF(AwayTeam!D36=\"\",\"\",AwayTeam!D36)","v":"Harris Fleming"},null,"1.38.00",2,{"$f":"CalcRelayPoints(G274)","v":3}]
[37,null,3,{"$f":"IF(AwayTeam!D37=\"\",\"\",AwayTeam!D37)","v":"Leanne Balmer"}]
[null,null,null,{"$f":"IF(AwayTeam!D38=\"\",\"\",AwayTeam!D38)","v":"Matthew Nicholl"}]
["A",null,null,{"$f":"IF(AwayTeam!D39=\"\",\"\",AwayTeam!D39)","v":"Jayne McNeill"}]
[null,{"$f":"HomeTeam!$C$4","v":"Lecale"},null,{"$f":"IF(HomeTeam!D30=\"\",\"\",HomeTeam!D30)","v":"Mark Knight"},null,"1.37.41",{"$f":"IF(G274=\"\",\"\",IF(G274=1,2,1))","v":1},null,{"$f":"CalcRelayPoints(G278)","v":7}]
[null,null,4,{"$f":"IF(HomeTeam!D31=\"\",\"\",HomeTeam!D31)","v":"Essie Costello"}]
[null,null,null,{"$f":"IF(HomeTeam!D32=\"\",\"\",HomeTeam!D32)","v":"Enya Clarke"}]
[null,null,null,{"$f":"IF(HomeTeam!D33=\"\",\"\",HomeTeam!D33)","v":"Henry Costello"}]
[null,{"$f":"AwayTeam!$C$4","v":"Ballymoney"},null,{"$f":"IF(AwayTeam!I36=\"\",\"\",AwayTeam!I36)","v":"Joe Colley"},null,"1.24.47",2,{"$f":"CalcRelayPoints(G282)","v":3}]
[38,null,3,{"$f":"IF(AwayTeam!I37=\"\",\"\",AwayTeam!I37)","v":"Daisy Dunlop"}]
[null,null,null,{"$f":"IF(AwayTeam!I38=\"\",\"\",AwayTeam!I38)","v":"Sophie McCormick"}]
["B",null,null,{"$f":"IF(AwayTeam!I39=\"\",\"\",AwayTeam!I39)","v":"James Green"}]
[null,{"$f":"HomeTeam!$C$4","v":"Lecale"},null,{"$f":"IF(HomeTeam!I30=\"\",\"\",HomeTeam!I30)","v":"Tom Costello"},null,"1.18.59",{"$f":"IF(G282=\"\",\"\",IF(G282=1,2,1))","v":1},null,{"$f":"CalcRelayPoints(G286)","v":7}]
[null,null,4,{"$f":"IF(HomeTeam!I31=\"\",\"\",HomeTeam!I31)","v":"Charlotte Savage"}]
[null,null,null,{"$f":"IF(HomeTeam!I32=\"\",\"\",HomeTeam!I32)","v":"Olivia Miskelly"}]
[null,null,null,{"$f":"IF(HomeTeam!I33=\"\",\"\",HomeTeam!I33)","v":"Niall Mc Cauley"}]
[null,{"$f":"AwayTeam!$C$4","v":"Ballymoney"},null,{"$f":"IF(AwayTeam!D40=\"\",\"\",AwayTeam!D40)","v":"Alfie McFaull"},null,"1.12.42",2,{"$f":"CalcRelayPoints(G290)","v":3}]
[39,null,3,{"$f":"IF(AwayTeam!D41=\"\",\"\",AwayTeam!D41)","v":"Chloe Nicholl"}]
[null,null,null,{"$f":"IF(AwayTeam!D42=\"\",\"\",AwayTeam!D42)","v":"Molly Atchison"}]
["C",null,null,{"$f":"IF(AwayTeam!D43=\"\",\"\",AwayTeam!D43)","v":"Reece Doherty"}]
[null,{"$f":"HomeTeam!$C$4","v":"Lecale"},null,{"$f":"IF(HomeTeam!D34=\"\",\"\",HomeTeam!D34)","v":"Thomas Hanlon"},null,"1.12.47",{"$f":"IF(G290=\"\",\"\",IF(G290=1,2,1))","v":1},null,{"$f":"CalcRelayPoints(G294)","v":7}]
[null,null,4,{"$f":"IF(HomeTeam!D35=\"\",\"\",HomeTeam!D35)","v":"Emily Burns"}]
[null,null,null,{"$f":"IF(HomeTeam!D36=\"\",\"\",HomeTeam!D36)","v":"Amy Quinn"}]
[null,null,null,{"$f":"IF(HomeTeam!D37=\"\",\"\",HomeTeam!D37)","v":"Noah Sheridan"}]
[null,{"$f":"AwayTeam!$C$4","v":"Ballymoney"},null,{"$f":"IF(AwayTeam!I40=\"\",\"\",AwayTeam!I40)","v":"Jamie Watson"},null,"1.13.20",2,{"$f":"CalcRelayPoints(G298)","v":3}]
[40,null,3,{"$f":"IF(AwayTeam!I41=\"\",\"\",AwayTeam!I41)","v":"Angus Loughridge"}]
[null,null,null,{"$f":"IF(AwayTeam!I42=\"\",\"\",AwayTeam!I42)","v":"Tea McWilliam"}]
["D",null,null,{"$f":"IF(AwayTeam!I43=\"\",\"\",AwayTeam!I43)","v":"Jessica Dunlop"}]
[null,{"$f":"HomeTeam!$C$4","v":"Lecale"},null,{"$f":"IF(HomeTeam!I34=\"\",\"\",HomeTeam!I34)","v":"Tom Mc Cormack"},null,"1.08.82",{"$f":"IF(G298=\"\",\"\",IF(G298=1,2,1))","v":1},null,{"$f":"CalcRelayPoints(G302)","v":7}]
[null,null,4,{"$f":"IF(HomeTeam!I35=\"\",\"\",HomeTeam!I35)","v":"Catriona Clarke"}]
[null,null,null,{"$f":"IF(HomeTeam!I36=\"\",\"\",HomeTeam!I36)","v":"Bebhionn Rogan"}]
[null,null,null,{"$f":"IF(HomeTeam!I37=\"\",\"\",HomeTeam!I37)","v":"Adam Colgan"}]
[null,null,null,null,null,null,"Sub tot",{"$f":"IF(SUM(H298,H290,H282,H274)=0,\"\",SUM(H298,H290,H282,H274))","v":12},{"$f":"IF(SUM(I302,I294,I286,I278)=0,\"\",SUM(I302,I294,I286,I278))","v":28}]
[null,null,null,null,null,null,"b/f tot",{"$f":"H268","v":161},{"$f":"I268","v":199}]
[null,null,null,null,null,null,"Total",{"$f":"IF(SUM(H306:H307)=0,\"\",SUM(H306:H307))","v":173},{"$f":"IF(SUM(I306:I307)=0,\"\",SUM(I306:I307))","v":227}]

{"sheet":"AwayTeam","index":2,"n_rows":43,"n_cols":10,"rows_kept":43,"cut":false,"hidden":false,"merged":[[39,0,42,0],[39,5,42,5],[1,0,1,9],[3,2,3,4],[5,0,8,0],[5,5,8,5],[9,0,12,0],[9,5,12,5],[35,0,38,0],[35,5,38,5]]}
[]
["BELFAST TELEGRAPH TELETOTS MARSHALLING SHEET"]
[]
["Away Team:",null,"Ballymoney",null,null,{"$f":"A4","v":"Away Team:"},null,{"$f":"C4","v":"Ballymoney"}]
["Event No","Event","Lane 1","Lane 3","Lane 5","Event No","Event","Lane 1","Lane 3","Lane 5"]
[1,"Group A Medley Relay","Erin Murray","Jayne McNeill",null,2,"Group B Medley Relay","Joshua Carroll","Joe Colley"]
[null,"Group A Medley Relay","Rachael Hill","Harris Fleming",null,null,"Group B Medley Relay","Faye Dempsey","James Green"]
[null,"Group A Medley Relay","Leah Scullion","Matthew Nicholl",null,null,"Group B Medley Relay","Jack Dempsey","Sophie McCormick"]
[null,"Group A Medley Relay","Clara McNeill","Leanne Balmer",null,null,"Group B Medley Relay","Mollie Gurney","Daisy Dunlop"]
[3,"Group C Medley Relay","Paddi Pollock-Quinn","Reece Doherty",null,4,"Group D Medley Relay",null,"Tea McWilliam"]
[null,"Group C Medley Relay","Leah Atkinson","Alfie McFaull",null,null,"Group D Medley Relay",null,"Jamie Watson"]
[null,"Group C Medley Relay","Lucy Maguire","Molly Atchison",null,null,"Group D Medley Relay",null,"Jessica Dunlop"]
[null,"Group C Medley Relay","Izzi Pollock-Quinn","Chloe Nicholl",null,null,"Group D Medley Relay",null,"Angus Loughridge"]
[5,"Girls Group A Backstroke","Leanne Balmer","Jayne McNeill","Erin Murray",6,"Boys Group A Backstroke","Harris Fleming","Matthew Nicholl"]
["6A","Group A Backstroke extra","Clara McNeill","Taisie O'Donnell","Mollie Gurney"]
[7,"Girls Group B Backstroke","Daisy Dunlop","Sophie McCormick","Rachael Hill",8,"Boys Group B Backstroke","Joe Colley","James Green"]
["8A","Group B Backstroke extra","Leah Atkinson","Joshua Carroll"]
[9,"Girls Group C Backstroke","Chloe Nicholl","Molly Atchison","Izzi Pollock-Quinn",10,"Boys Group C Backstroke","Reece Doherty","Alfie McFaull"]
["10A","Group C Backstroke extra","Faye Dempsey"]
[11,"Girls Group D Backstroke","Jessica Dunlop","Tea McWilliam","Leah Scullion",12,"Boys Group D Backstroke","Jamie Watson","Angus Loughridge"]
[13,"Girls Group A Breaststroke","Leanne Balmer","Jayne McNeill","Erin Murray",14,"Boys Group A Breaststroke","Harris Fleming","Matthew Nicholl"]
[15,"Girls Group B Breaststroke","Daisy Dunlop","Sophie McCormick","Leah Atkinson",16,"Boys Group B Breaststroke","Joe Colley",".James Green"]
[17,"Girls Group C Breaststroke","Chloe Nicholl","Molly Atchison","Faye Dempsey",18,"Boys Group C Breaststroke","Reece Doherty","Alfie McFaull"]
[19,"Girls Group D Breaststroke","Jessica Dunlop","Tea McWilliam","Leah Scullion",20,"Boys Group D Breaststroke","Jamie Watson","Jack Dempsey"]
[21,"Girls Group A Butterfly","Leanne Balmer","Jayne McNeill","Erin Murray",22,"Boys Group A Butterfly","Harris Fleming","Matthew Nicholl"]
[23,"Girls Group B Butterfly","Daisy Dunlop","Sophie McCormick","Rachael Hill",24,"Boys Group B Butterfly","Joe Colley","James Green"]
[25,"Girls Group C Butterfly","Chloe Nicholl","Molly Atchison","Izzi Pollock-Quinn",26,"Boys Group C Butterfly","Reece Doherty","Alfie McFaull"]
[27,"Girls Group D Butterfly","Jessica Dunlop","Tea McWilliam","Lucy Maguire",28,"Boys Group D Butterfly","Jamie Watson","Angus Loughridge"]
[29,"Girls Group A Front Crawl","Leanne Balmer","Jayne McNeill","Erin Murray",30,"Boys Group A Front Crawl","Harris Fleming","Matthew Nicholl"]
["30A","Group A Front Crawl extra","Clara McNeill","Taisie O'Donnell","Mollie Gurney"]
[31,"Girls Group B Front Crawl","Daisy Dunlop","Sophie McCormick","Leah Atkinson",32,"Boys Group B Front Crawl","Joe Colley","James Green"]
["32A","Group B Front Crawl extra","Rachael Hill","Joshua Carroll"]
[33,"Girls Group C Front Crawl","Chloe Nicholl","Molly Atchison","Faye Dempsey",34,"Boys Group C Front Crawl","Reece Doherty","Alfie McFaull"]
["34A","Group C Front Crawl extra","Izzi Pollock-Quinn"]
[35,"Girls Group D Front Crawl","Jessica Dunlop","Tea McWilliam","Lucy Maguire",36,"Boys Group D Front Crawl","Jamie Watson","Jack Dempsey"]
[37,"Group A Freestyle Relay","Leah Scullion","Harris Fleming",null,38,"Group B Freestyle Relay","Jack Dempsey","Joe Colley"]
[null,"Group A Freestyle Relay","Erin Murray","Leanne Balmer",null,null,"Group B Freestyle Relay","Faye Dempsey","Daisy Dunlop"]
[null,"Group A Freestyle Relay","Rachael Hill","Matthew Nicholl",null,null,"Group B Freestyle Relay","Joshua Carroll","Sophie McCormick"]
[null,"Group A Freestyle Relay","Taisie O'Donnell","Jayne McNeill",null,null,"Group B Freestyle Relay","Mollie Gurney","James Green"]
[39,"Group C Freestyle Relay","Izzi Pollock-Quinn","Alfie McFaull",null,40,"Group D Freestyle Relay",null,"Jamie Watson"]
[null,"Group C Freestyle Relay","Leah Atkinson","Chloe Nicholl",null,null,"Group D Freestyle Relay",null,"Angus Loughridge"]
[null,"Group C Freestyle Relay","Paddi Pollock-Quinn","Molly Atchison",null,null,"Group D Freestyle Relay",null,"Tea McWilliam"]
[null,"Group C Freestyle Relay","Lucy Maguire","Reece Doherty",null,null,"Group D Freestyle Relay",null,"Jessica Dunlop"]

{"sheet":"HomeTeamAnalysis","index":3,"n_rows":52,"n_cols":11,"rows_kept":52,"cut":false,"hidden":false,"merged":[[1,9,1,10],[1,1,1,2]]}
[null,"Teletots Gala",null,null,null,null,null,null,null,"Date",{"$f":"RecordingSheet!B8","v":"00:00:00"}]
[null,{"$f":"HomeTeam!C4","v":"Lecale"},null,null,null,"Vs",null,null,null,"Lurgan"]
[null,"Points",null,null,null,null,null,null,null,"Points"]
[null,"Group","Gender","Stroke","Name","Time","Group","Gender","Stroke","Name","Time"]
[null,{"$f":"RecordingSheet!$A$55","v":"A"},{"$f":"RecordingSheet!$A$56","v":"GIRLS"},{"$f":"RecordingSheet!$A$50","v":"BACKSTROKE"},{"$f":"RecordingSheet!D56","v":"Essie Costello"},{"$f":"RecordingSheet!F56","v":33.909999999999997},{"$f":"RecordingSheet!$A$55","v":"A"},"BOYS",{"$f":"RecordingSheet!$A$50","v":"BACKSTROKE"},{"$f":"RecordingSheet!D62","v":"Mark Knight"},{"$f":"RecordingSheet!F62","v":33.33}]
[null,{"$f":"RecordingSheet!$A$55","v":"A"},{"$f":"RecordingSheet!$A$56","v":"GIRLS"},{"$f":"RecordingSheet!$A$50","v":"BACKSTROKE"},{"$f":"RecordingSheet!D57","v":"Enya Clarke"},{"$f":"RecordingSheet!F57","v":26.12},{"$f":"RecordingSheet!$A$55","v":"A"},"BOYS",{"$f":"RecordingSheet!$A$50","v":"BACKSTROKE"},{"$f":"RecordingSheet!D63","v":"Henry Costello"},{"$f":"RecordingSheet!F63","v":24.37}]
[null,{"$f":"RecordingSheet!$A$55","v":"A"},{"$f":"RecordingSheet!$A$56","v":"GIRLS"},{"$f":"RecordingSheet!$A$50","v":"BACKSTROKE"},{"$f":"RecordingSheet!D58","v":""},{"$f":"RecordingSheet!F58","v":0},{"$f":"RecordingSheet!$A$55","v":"A"},"BOYS",{"$f":"RecordingSheet!$A$50","v":"BACKSTROKE"},{"$f":"RecordingSheet!D64","v":"Cormac Byrne"},{"$f":"RecordingSheet!F64","v":29.47}]
[null,"B",{"$f":"RecordingSheet!$A$56","v":"GIRLS"},{"$f":"RecordingSheet!$A$50","v":"BACKSTROKE"},{"$f":"RecordingSheet!D68","v":"Charlotte Savage"},{"$f":"RecordingSheet!F68","v":22.8},"B","BOYS",{"$f":"RecordingSheet!$A$50","v":"BACKSTROKE"},{"$f":"RecordingSheet!D74","v":"Tom Costello"},{"$f":"RecordingSheet!F74","v":27.16}]
[null,"B",{"$f":"RecordingSheet!$A$56","v":"GIRLS"},{"$f":"RecordingSheet!$A$50","v":"BACKSTROKE"},{"$f":"RecordingSheet!D69","v":"Olivia Miskelly"},{"$f":"RecordingSheet!F69","v":21.41},"B","BOYS",{"$f":"RecordingSheet!$A$50","v":"BACKSTROKE"},{"$f":"RecordingSheet!D75","v":"Niall Mc Cauley"},{"$f":"RecordingSheet!F75","v":23.25}]
[null,"B",{"$f":"RecordingSheet!$A$56","v":"GIRLS"},{"$f":"RecordingSheet!$A$50","v":"BACKSTROKE"},{"$f":"RecordingSheet!D70","v":""},{"$f":"RecordingSheet!F70","v":0},"B","BOYS",{"$f":"RecordingSheet!$A$50","v":"BACKSTROKE"},{"$f":"RecordingSheet!D76","v":"Micheal Uhomobhi"},{"$f":"RecordingSheet!F76","v":28.53}]
[null,"C",{"$f":"RecordingSheet!$A$56","v":"GIRLS"},{"$f":"RecordingSheet!$A$50","v":"BACKSTROKE"},{"$f":"RecordingSheet!D80","v":"Ellen Doran"},{"$f":"RecordingSheet!F80","v":21.93},"C","BOYS",{"$f":"RecordingSheet!$A$50","v":"BACKSTROKE"},{"$f":"RecordingSheet!D86","v":"Thomas Nay"},{"$f":"RecordingSheet!F86","v":23.5}]
[null,"C",{"$f":"RecordingSheet!$A$56","v":"GIRLS"},{"$f":"RecordingSheet!$A$50","v":"BACKSTROKE"},{"$f":"RecordingSheet!D81","v":"Amy Quinn"},{"$f":"RecordingSheet!F81","v":20.84},"C","BOYS",{"$f":"RecordingSheet!$A$50","v":"BACKSTROKE"},{"$f":"RecordingSheet!D87","v":"Ben Murtagh"},{"$f":"RecordingSheet!F87","v":24.72}]
[null,"C",{"$f":"RecordingSheet!$A$56","v":"GIRLS"},{"$f":"RecordingSheet!$A$50","v":"BACKSTROKE"},{"$f":"RecordingSheet!D82","v":""},{"$f":"RecordingSheet!F82","v":0},"C","BOYS",{"$f":"RecordingSheet!$A$50","v":"BACKSTROKE"},{"$f":"RecordingSheet!D88","v":"Noah Sheridan"},{"$f":"RecordingSheet!F88","v":23.54}]
[null,"D",{"$f":"RecordingSheet!$A$56","v":"GIRLS"},{"$f":"RecordingSheet!$A$50","v":"BACKSTROKE"},{"$f":"RecordingSheet!D92","v":"Bebhionn Rogan"},{"$f":"RecordingSheet!F92","v":20.47},"D","BOYS",{"$f":"RecordingSheet!$A$50","v":"BACKSTROKE"},{"$f":"RecordingSheet!D98","v":"Christopher Mason"},{"$f":"RecordingSheet!F98","v":20.63}]
[null,"D",{"$f":"RecordingSheet!$A$56","v":"GIRLS"},{"$f":"RecordingSheet!$A$50","v":"BACKSTROKE"},{"$f":"RecordingSheet!D93","v":"Catriona Clarke"},{"$f":"RecordingSheet!F93","v":20.22},"D","BOYS",{"$f":"RecordingSheet!$A$50","v":"BACKSTROKE"},{"$f":"RecordingSheet!D99","v":"Adam Colgan"},{"$f":"RecordingSheet!F99","v":17.190000000000001}]
[null,"D",{"$f":"RecordingSheet!$A$56","v":"GIRLS"},{"$f":"RecordingSheet!$A$50","v":"BACKSTROKE"},{"$f":"RecordingSheet!D94","v":""},{"$f":"RecordingSheet!F94","v":0},"D","BOYS",{"$f":"RecordingSheet!$A$50","v":"BACKSTROKE"},{"$f":"RecordingSheet!D100","v":"Tom Mc Cormack"},{"$f":"RecordingSheet!F100","v":0}]
[null,{"$f":"RecordingSheet!$A$55","v":"A"},{"$f":"RecordingSheet!$A$56","v":"GIRLS"},"BREASTSTROKE",{"$f":"RecordingSheet!D111","v":"Essie Costello"},{"$f":"RecordingSheet!F111","v":31.68},{"$f":"RecordingSheet!$A$55","v":"A"},"BOYS","BREASTSTROKE",{"$f":"RecordingSheet!D117","v":"Mark Knight"},{"$f":"RecordingSheet!F117","v":37.44}]
[null,{"$f":"RecordingSheet!$A$55","v":"A"},{"$f":"RecordingSheet!$A$56","v":"GIRLS"},"BREASTSTROKE",{"$f":"RecordingSheet!D112","v":"Enya Clarke"},{"$f":"RecordingSheet!F112","v":31.85},{"$f":"RecordingSheet!$A$55","v":"A"},"BOYS","BREASTSTROKE",{"$f":"RecordingSheet!D118","v":"Henry Costello"},{"$f":"RecordingSheet!F118","v":32.28}]
[null,{"$f":"RecordingSheet!$A$55","v":"A"},{"$f":"RecordingSheet!$A$56","v":"GIRLS"},"BREASTSTROKE",{"$f":"RecordingSheet!D113","v":""},{"$f":"RecordingSheet!F113","v":0},{"$f":"RecordingSheet!$A$55","v":"A"},"BOYS","BREASTSTROKE",{"$f":"RecordingSheet!D119","v":"Lucas O'Neill"},{"$f":"RecordingSheet!F119","v":37.54}]
[null,"B",{"$f":"RecordingSheet!$A$56","v":"GIRLS"},"BREASTSTROKE",{"$f":"RecordingSheet!D123","v":"Charlotte Savage"},{"$f":"RecordingSheet!F123","v":27.27},"B","BOYS","BREASTSTROKE",{"$f":"RecordingSheet!D129","v":"Tom Costello"},{"$f":"RecordingSheet!F129","v":29.02}]
[null,"B",{"$f":"RecordingSheet!$A$56","v":"GIRLS"},"BREASTSTROKE",{"$f":"RecordingSheet!D124","v":"Olivia Miskelly"},{"$f":"RecordingSheet!F124","v":24.5},"B","BOYS","BREASTSTROKE",{"$f":"RecordingSheet!D130","v":"Niall Mc Cauley"},{"$f":"RecordingSheet!F130","v":25.57}]
[null,"B",{"$f":"RecordingSheet!$A$56","v":"GIRLS"},"BREASTSTROKE",{"$f":"RecordingSheet!D125","v":""},{"$f":"RecordingSheet!F125","v":0},"B","BOYS","BREASTSTROKE",{"$f":"RecordingSheet!D131","v":"Micheal Uhomobhi"},{"$f":"RecordingSheet!F131","v":31.75}]
[null,"C",{"$f":"RecordingSheet!$A$56","v":"GIRLS"},"BREASTSTROKE",{"$f":"RecordingSheet!D135","v":"Amy Quinn"},{"$f":"RecordingSheet!F135","v":27.42},"C","BOYS","BREASTSTROKE",{"$f":"RecordingSheet!D141","v":"Thomas Nay"},{"$f":"RecordingSheet!F141","v":26.53}]
[null,"C",{"$f":"RecordingSheet!$A$56","v":"GIRLS"},"BREASTSTROKE",{"$f":"RecordingSheet!D136","v":"Emily Burns"},{"$f":"RecordingSheet!F136","v":26.81},"C","BOYS","BREASTSTROKE",{"$f":"RecordingSheet!D142","v":"Noah Sheridan"},{"$f":"RecordingSheet!F142","v":26.84}]
[null,"C",{"$f":"RecordingSheet!$A$56","v":"GIRLS"},"BREASTSTROKE",{"$f":"RecordingSheet!D137","v":""},{"$f":"RecordingSheet!F137","v":0},"C","BOYS","BREASTSTROKE",{"$f":"RecordingSheet!D143","v":"Ben Murtagh"},{"$f":"RecordingSheet!F143","v":29.78}]
[null,"D",{"$f":"RecordingSheet!$A$56","v":"GIRLS"},"BREASTSTROKE",{"$f":"RecordingSheet!D147","v":"Alicia Dobbin"},{"$f":"RecordingSheet!F147","v":21.9},"D","BOYS","BREASTSTROKE",{"$f":"RecordingSheet!D153","v":"Christopher Mason"},{"$f":"RecordingSheet!F153","v":23.34}]
[null,"D",{"$f":"RecordingSheet!$A$56","v":"GIRLS"},"BREASTSTROKE",{"$f":"RecordingSheet!D148","v":"Kiera Knight"},{"$f":"RecordingSheet!F148","v":22.28},"D","BOYS","BREASTSTROKE",{"$f":"RecordingSheet!D154","v":"Adam Colgan"},{"$f":"RecordingSheet!F154","v":19.75}]
[null,"D",{"$f":"RecordingSheet!$A$56","v":"GIRLS"},"BREASTSTROKE",{"$f":"RecordingSheet!D149","v":""},{"$f":"RecordingSheet!F149","v":0},"D","BOYS","BREASTSTROKE",{"$f":"RecordingSheet!D155","v":"Tom Mc Cormack"},{"$f":"RecordingSheet!F155","v":23.28}]
[null,{"$f":"RecordingSheet!$A$55","v":"A"},{"$f":"RecordingSheet!$A$56","v":"GIRLS"},"BUTTERFLY",{"$f":"RecordingSheet!D166","v":"Essie Costello"},{"$f":"RecordingSheet!F166","v":32.479999999999997},{"$f":"RecordingSheet!$A$55","v":"A"},"BOYS","BUTTERFLY",{"$f":"RecordingSheet!D172","v":"Mark Knight"},{"$f":"RecordingSheet!F172","v":32.06}]
[null,{"$f":"RecordingSheet!$A$55","v":"A"},{"$f":"RecordingSheet!$A$56","v":"GIRLS"},"BUTTERFLY",{"$f":"RecordingSheet!D167","v":"Enya Clarke"},{"$f":"RecordingSheet!F167","v":29.03},{"$f":"RecordingSheet!$A$55","v":"A"},"BOYS","BUTTERFLY",{"$f":"RecordingSheet!D173","v":"Henry Costello"},{"$f":"RecordingSheet!F173","v":29.91}]
[null,{"$f":"RecordingSheet!$A$55","v":"A"},{"$f":"RecordingSheet!$A$56","v":"GIRLS"},"BUTTERFLY",{"$f":"RecordingSheet!D168","v":""},{"$f":"RecordingSheet!F168","v":0},{"$f":"RecordingSheet!$A$55","v":"A"},"BOYS","BUTTERFLY",{"$f":"RecordingSheet!D174","v":"Cormac Byrne"},{"$f":"RecordingSheet!F174","v":32.78}]
[null,"B",{"$f":"RecordingSheet!$A$56","v":"GIRLS"},"BUTTERFLY",{"$f":"RecordingSheet!D178","v":"Charlotte Savage"},{"$f":"RecordingSheet!F178","v":22.56},"B","BOYS","BUTTERFLY",{"$f":"RecordingSheet!D184","v":"Tom Costello"},{"$f":"RecordingSheet!F184","v":23.69}]
[null,"B",{"$f":"RecordingSheet!$A$56","v":"GIRLS"},"BUTTERFLY",{"$f":"RecordingSheet!D179","v":"Olivia Miskelly"},{"$f":"RecordingSheet!F179","v":20.420000000000002},"B","BOYS","BUTTERFLY",{"$f":"RecordingSheet!D185","v":"Niall Mc Cauley"},{"$f":"RecordingSheet!F185","v":25.12}]
[null,"B",{"$f":"RecordingSheet!$A$56","v":"GIRLS"},"BUTTERFLY",{"$f":"RecordingSheet!D180","v":""},{"$f":"RecordingSheet!F180","v":0},"B","BOYS","BUTTERFLY",{"$f":"RecordingSheet!D186","v":"Micheal Uhomobhi"},{"$f":"RecordingSheet!F186","v":32.22}]
[null,"C",{"$f":"RecordingSheet!$A$56","v":"GIRLS"},"BUTTERFLY",{"$f":"RecordingSheet!D190","v":"Emily Burns"},{"$f":"RecordingSheet!F190","v":20.420000000000002},"C","BOYS","BUTTERFLY",{"$f":"RecordingSheet!D196","v":"Thomas Hanlon"},{"$f":"RecordingSheet!F196","v":22.59}]
[null,"C",{"$f":"RecordingSheet!$A$56","v":"GIRLS"},"BUTTERFLY",{"$f":"RecordingSheet!D191","v":"Amy Quinn"},{"$f":"RecordingSheet!F191","v":19.78},"C","BOYS","BUTTERFLY",{"$f":"RecordingSheet!D197","v":"Thomas Nay"},{"$f":"RecordingSheet!F197","v":22.25}]
[null,"C",{"$f":"RecordingSheet!$A$56","v":"GIRLS"},"BUTTERFLY",{"$f":"RecordingSheet!D192","v":""},{"$f":"RecordingSheet!F192","v":0},"C","BOYS","BUTTERFLY",{"$f":"RecordingSheet!D198","v":"Noah Sheridan"},{"$f":"RecordingSheet!F198","v":27.09}]
[null,"D",{"$f":"RecordingSheet!$A$56","v":"GIRLS"},"BUTTERFLY",{"$f":"RecordingSheet!D202","v":"Bebhionn Rogan"},{"$f":"RecordingSheet!F202","v":17.5},"D","BOYS","BUTTERFLY",{"$f":"RecordingSheet!D208","v":"Tom Mc Cormack"},{"$f":"RecordingSheet!F208","v":20.28}]
[null,"D",{"$f":"RecordingSheet!$A$56","v":"GIRLS"},"BUTTERFLY",{"$f":"RecordingSheet!D203","v":"Catriona Clarke"},{"$f":"RecordingSheet!F203","v":18.66},"D","BOYS","BUTTERFLY",{"$f":"RecordingSheet!D209","v":"Adam Colgan"},{"$f":"RecordingSheet!F209","v":15.72}]
[null,"D",{"$f":"RecordingSheet!$A$56","v":"GIRLS"},"BUTTERFLY",{"$f":"RecordingSheet!D204","v":""},{"$f":"RecordingSheet!F204","v":0},"D","BOYS","BUTTERFLY",{"$f":"RecordingSheet!D210","v":"Christopher Mason"},{"$f":"RecordingSheet!F210","v":21.34}]
[null,{"$f":"RecordingSheet!$A$55","v":"A"},{"$f":"RecordingSheet!$A$56","v":"GIRLS"},"FRONT CRAWL",{"$f":"RecordingSheet!D221","v":"Essie Costello "},{"$f":"RecordingSheet!F221","v":28.25},{"$f":"RecordingSheet!$A$55","v":"A"},"BOYS","FRONT CRAWL",{"$f":"RecordingSheet!D227","v":"Mark Knight"},{"$f":"RecordingSheet!F227","v":25.02}]
[null,{"$f":"RecordingSheet!$A$55","v":"A"},{"$f":"RecordingSheet!$A$56","v":"GIRLS"},"FRONT CRAWL",{"$f":"RecordingSheet!D222","v":"Enya Clarke"},{"$f":"RecordingSheet!F222","v":23.25},{"$f":"RecordingSheet!$A$55","v":"A"},"BOYS","FRONT CRAWL",{"$f":"RecordingSheet!D228","v":"Henry Costello"},{"$f":"RecordingSheet!F228","v":21}]
[null,{"$f":"RecordingSheet!$A$55","v":"A"},{"$f":"RecordingSheet!$A$56","v":"GIRLS"},"FRONT CRAWL",{"$f":"RecordingSheet!D223","v":""},{"$f":"RecordingSheet!F223","v":0},{"$f":"RecordingSheet!$A$55","v":"A"},"BOYS","FRONT CRAWL",{"$f":"RecordingSheet!D229","v":"Lucas O'Neill"},{"$f":"RecordingSheet!F229","v":28.97}]
[null,"B",{"$f":"RecordingSheet!$A$56","v":"GIRLS"},"FRONT CRAWL",{"$f":"RecordingSheet!D233","v":"Charlotte Savage"},{"$f":"RecordingSheet!F233","v":19.649999999999999},"B","BOYS","FRONT CRAWL",{"$f":"RecordingSheet!D239","v":"Tom Costello"},{"$f":"RecordingSheet!F239","v":20.149999999999999}]
[null,"B",{"$f":"RecordingSheet!$A$56","v":"GIRLS"},"FRONT CRAWL",{"$f":"RecordingSheet!D234","v":"Olivia Miskelly"},{"$f":"RecordingSheet!F234","v":16.850000000000001},"B","BOYS","FRONT CRAWL",{"$f":"RecordingSheet!D240","v":"Niall Mc Cauley"},{"$f":"RecordingSheet!F240","v":17.809999999999999}]
[null,"B",{"$f":"RecordingSheet!$A$56","v":"GIRLS"},"FRONT CRAWL",{"$f":"RecordingSheet!D235","v":""},{"$f":"RecordingSheet!F235","v":0},"B","BOYS","FRONT CRAWL",{"$f":"RecordingSheet!D241","v":"Micheal Uhomobhi"},{"$f":"RecordingSheet!F241","v":21.12}]
[null,"C",{"$f":"RecordingSheet!$A$56","v":"GIRLS"},"FRONT CRAWL",{"$f":"RecordingSheet!D245","v":"Emily Burns"},{"$f":"RecordingSheet!F245","v":18.88},"C","BOYS","FRONT CRAWL",{"$f":"RecordingSheet!D251","v":"Noah Sheridan"},{"$f":"RecordingSheet!F251","v":18.559999999999999}]
[null,"C",{"$f":"RecordingSheet!$A$56","v":"GIRLS"},"FRONT CRAWL",{"$f":"RecordingSheet!D246","v":"Amy Quinn"},{"$f":"RecordingSheet!F246","v":17.649999999999999},"C","BOYS","FRONT CRAWL",{"$f":"RecordingSheet!D252","v":"Thomas Hanlon"},{"$f":"RecordingSheet!F252","v":17.84}]
[null,"C",{"$f":"RecordingSheet!$A$56","v":"GIRLS"},"FRONT CRAWL",{"$f":"RecordingSheet!D247","v":""},{"$f":"RecordingSheet!F247","v":0},"C","BOYS","FRONT CRAWL",{"$f":"RecordingSheet!D253","v":"Ben Murtagh"},{"$f":"RecordingSheet!F253","v":21.53}]
[null,"D",{"$f":"RecordingSheet!$A$56","v":"GIRLS"},"FRONT CRAWL",{"$f":"RecordingSheet!D257","v":"Catriona Clarke"},{"$f":"RecordingSheet!F257","v":17.55},"D","BOYS","FRONT CRAWL",{"$f":"RecordingSheet!D263","v":"Tom Mc Cormack"},{"$f":"RecordingSheet!F263","v":17.09}]
[null,"D",{"$f":"RecordingSheet!$A$56","v":"GIRLS"},"FRONT CRAWL",{"$f":"RecordingSheet!D258","v":"Bebhionn Rogan"},{"$f":"RecordingSheet!F258","v":16.82},"D","BOYS","FRONT CRAWL",{"$f":"RecordingSheet!D264","v":"Adam Colgan"},{"$f":"RecordingSheet!F264","v":14.62}]
[null,"D",{"$f":"RecordingSheet!$A$56","v":"GIRLS"},"FRONT CRAWL",{"$f":"RecordingSheet!D259","v":""},{"$f":"RecordingSheet!F259","v":0},"D","BOYS","FRONT CRAWL",{"$f":"RecordingSheet!D265","v":"Christopher Mason"},{"$f":"RecordingSheet!F265","v":17.13}]

{"sheet":"AwayTeamAnalysis","index":4,"n_rows":52,"n_cols":11,"rows_kept":52,"cut":false,"hidden":false,"merged":[[1,9,1,10],[1,1,1,2]]}
[null,"Teletots Gala",null,null,null,null,null,null,null,"Date",{"$f":"RecordingSheet!B8","v":"00:00:00"}]
[null,{"$f":"HomeTeam!C4","v":"Lecale"},null,null,null,"Vs",null,null,null,"Lurgan"]
[null,"Points",null,null,null,null,null,null,null,"Points"]
[null,"Group","Gender","Stroke","Name","Time","Group","Gender","Stroke","Name","Time"]
[null,{"$f":"RecordingSheet!$A$55","v":"A"},{"$f":"RecordingSheet!$A$56","v":"GIRLS"},{"$f":"RecordingSheet!$A$50","v":"BACKSTROKE"},{"$f":"RecordingSheet!D53","v":"Leanne Balmer"},{"$f":"RecordingSheet!F53","v":32.25},{"$f":"RecordingSheet!$A$55","v":"A"},"BOYS",{"$f":"RecordingSheet!$A$50","v":"BACKSTROKE"},{"$f":"RecordingSheet!D59","v":"Harris Fleming"},{"$f":"RecordingSheet!F59","v":28.1}]
[null,{"$f":"RecordingSheet!$A$55","v":"A"},{"$f":"RecordingSheet!$A$56","v":"GIRLS"},{"$f":"RecordingSheet!$A$50","v":"BACKSTROKE"},{"$f":"RecordingSheet!D54","v":"Jayne McNeill"},{"$f":"RecordingSheet!F54","v":28},{"$f":"RecordingSheet!$A$55","v":"A"},"BOYS",{"$f":"RecordingSheet!$A$50","v":"BACKSTROKE"},{"$f":"RecordingSheet!D60","v":"Matthew Nicholl"},{"$f":"RecordingSheet!F60","v":28.29}]
[null,{"$f":"RecordingSheet!$A$55","v":"A"},{"$f":"RecordingSheet!$A$56","v":"GIRLS"},{"$f":"RecordingSheet!$A$50","v":"BACKSTROKE"},{"$f":"RecordingSheet!D55","v":"Erin Murray"},{"$f":"RecordingSheet!F55","v":41.5},{"$f":"RecordingSheet!$A$55","v":"A"},"BOYS",{"$f":"RecordingSheet!$A$50","v":"BACKSTROKE"},{"$f":"RecordingSheet!D61","v":""},{"$f":"RecordingSheet!F61","v":0}]
[null,"B",{"$f":"RecordingSheet!$A$56","v":"GIRLS"},{"$f":"RecordingSheet!$A$50","v":"BACKSTROKE"},{"$f":"RecordingSheet!D65","v":"Daisy Dunlop"},{"$f":"RecordingSheet!F65","v":29.53},"B","BOYS",{"$f":"RecordingSheet!$A$50","v":"BACKSTROKE"},{"$f":"RecordingSheet!D71","v":"Joe Colley"},{"$f":"RecordingSheet!F71","v":24.16}]
[null,"B",{"$f":"RecordingSheet!$A$56","v":"GIRLS"},{"$f":"RecordingSheet!$A$50","v":"BACKSTROKE"},{"$f":"RecordingSheet!D66","v":"Sophie McCormick"},{"$f":"RecordingSheet!F66","v":26.4},"B","BOYS",{"$f":"RecordingSheet!$A$50","v":"BACKSTROKE"},{"$f":"RecordingSheet!D72","v":"James Green"},{"$f":"RecordingSheet!F72","v":21.96}]
[null,"B",{"$f":"RecordingSheet!$A$56","v":"GIRLS"},{"$f":"RecordingSheet!$A$50","v":"BACKSTROKE"},{"$f":"RecordingSheet!D67","v":"Rachael Hill"},{"$f":"RecordingSheet!F67","v":35},"B","BOYS",{"$f":"RecordingSheet!$A$50","v":"BACKSTROKE"},{"$f":"RecordingSheet!D73","v":""},{"$f":"RecordingSheet!F73","v":0}]
[null,"C",{"$f":"RecordingSheet!$A$56","v":"GIRLS"},{"$f":"RecordingSheet!$A$50","v":"BACKSTROKE"},{"$f":"RecordingSheet!D77","v":"Chloe Nicholl"},{"$f":"RecordingSheet!F77","v":23.45},"C","BOYS",{"$f":"RecordingSheet!$A$50","v":"BACKSTROKE"},{"$f":"RecordingSheet!D83","v":"Reece Doherty"},{"$f":"RecordingSheet!F83","v":21.12}]
[null,"C",{"$f":"RecordingSheet!$A$56","v":"GIRLS"},{"$f":"RecordingSheet!$A$50","v":"BACKSTROKE"},{"$f":"RecordingSheet!D78","v":"Molly Atchison"},{"$f":"RecordingSheet!F78","v":20.03},"C","BOYS",{"$f":"RecordingSheet!$A$50","v":"BACKSTROKE"},{"$f":"RecordingSheet!D84","v":"Alfie McFaull"},{"$f":"RecordingSheet!F84","v":22.94}]
[null,"C",{"$f":"RecordingSheet!$A$56","v":"GIRLS"},{"$f":"RecordingSheet!$A$50","v":"BACKSTROKE"},{"$f":"RecordingSheet!D79","v":"Izzi Pollock-Quinn"},{"$f":"RecordingSheet!F79","v":29},"C","BOYS",{"$f":"RecordingSheet!$A$50","v":"BACKSTROKE"},{"$f":"RecordingSheet!D85","v":""},{"$f":"RecordingSheet!F85","v":0}]
[null,"D",{"$f":"RecordingSheet!$A$56","v":"GIRLS"},{"$f":"RecordingSheet!$A$50","v":"BACKSTROKE"},{"$f":"RecordingSheet!D89","v":"Jessica Dunlop"},{"$f":"RecordingSheet!F89","v":22.45},"D","BOYS",{"$f":"RecordingSheet!$A$50","v":"BACKSTROKE"},{"$f":"RecordingSheet!D95","v":"Jamie Watson"},{"$f":"RecordingSheet!F95","v":23.32}]
[null,"D",{"$f":"RecordingSheet!$A$56","v":"GIRLS"},{"$f":"RecordingSheet!$A$50","v":"BACKSTROKE"},{"$f":"RecordingSheet!D90","v":"Tea McWilliam"},{"$f":"RecordingSheet!F90","v":19.5},"D","BOYS",{"$f":"RecordingSheet!$A$50","v":"BACKSTROKE"},{"$f":"RecordingSheet!D96","v":"Angus Loughridge"},{"$f":"RecordingSheet!F96","v":22.06}]
[null,"D",{"$f":"RecordingSheet!$A$56","v":"GIRLS"},{"$f":"RecordingSheet!$A$50","v":"BACKSTROKE"},{"$f":"RecordingSheet!D91","v":"Leah Scullion"},{"$f":"RecordingSheet!F91","v":21.34},"D","BOYS",{"$f":"RecordingSheet!$A$50","v":"BACKSTROKE"},{"$f":"RecordingSheet!D97","v":""},{"$f":"RecordingSheet!F97","v":0}]
[null,{"$f":"RecordingSheet!$A$55","v":"A"},{"$f":"RecordingSheet!$A$56","v":"GIRLS"},"BREASTSTROKE",{"$f":"RecordingSheet!D108","v":"Leanne Balmer"},{"$f":"RecordingSheet!F108","v":35.659999999999997},{"$f":"RecordingSheet!$A$55","v":"A"},"BOYS","BREASTSTROKE",{"$f":"RecordingSheet!D114","v":"Harris Fleming"},{"$f":"RecordingSheet!F114","v":28.81}]
[null,{"$f":"RecordingSheet!$A$55","v":"A"},{"$f":"RecordingSheet!$A$56","v":"GIRLS"},"BREASTSTROKE",{"$f":"RecordingSheet!D109","v":"Jayne McNeill"},{"$f":"RecordingSheet!F109","v":30.86},{"$f":"RecordingSheet!$A$55","v":"A"},"BOYS","BREASTSTROKE",{"$f":"RecordingSheet!D115","v":"Matthew Nicholl"},{"$f":"RecordingSheet!F115","v":41.31}]
[null,{"$f":"RecordingSheet!$A$55","v":"A"},{"$f":"RecordingSheet!$A$56","v":"GIRLS"},"BREASTSTROKE",{"$f":"RecordingSheet!D110","v":"Erin Murray"},{"$f":"RecordingSheet!F110","v":46.62},{"$f":"RecordingSheet!$A$55","v":"A"},"BOYS","BREASTSTROKE",{"$f":"RecordingSheet!D116","v":""},{"$f":"RecordingSheet!F116","v":0}]
[null,"B",{"$f":"RecordingSheet!$A$56","v":"GIRLS"},"BREASTSTROKE",{"$f":"RecordingSheet!D120","v":"Daisy Dunlop"},{"$f":"RecordingSheet!F120","v":33.81},"B","BOYS","BREASTSTROKE",{"$f":"RecordingSheet!D126","v":"Joe Colley"},{"$f":"RecordingSheet!F126","v":24.86}]
[null,"B",{"$f":"RecordingSheet!$A$56","v":"GIRLS"},"BREASTSTROKE",{"$f":"RecordingSheet!D121","v":"Sophie McCormick"},{"$f":"RecordingSheet!F121","v":30.09},"B","BOYS","BREASTSTROKE",{"$f":"RecordingSheet!D127","v":".James Green"},{"$f":"RecordingSheet!F127","v":22.37}]
[null,"B",{"$f":"RecordingSheet!$A$56","v":"GIRLS"},"BREASTSTROKE",{"$f":"RecordingSheet!D122","v":"Leah Atkinson"},{"$f":"RecordingSheet!F122","v":35.75},"B","BOYS","BREASTSTROKE",{"$f":"RecordingSheet!D128","v":""},{"$f":"RecordingSheet!F128","v":0}]
[null,"C",{"$f":"RecordingSheet!$A$56","v":"GIRLS"},"BREASTSTROKE",{"$f":"RecordingSheet!D132","v":"Chloe Nicholl"},{"$f":"RecordingSheet!F132","v":26.82},"C","BOYS","BREASTSTROKE",{"$f":"RecordingSheet!D138","v":"Reece Doherty"},{"$f":"RecordingSheet!F138","v":31.12}]
[null,"C",{"$f":"RecordingSheet!$A$56","v":"GIRLS"},"BREASTSTROKE",{"$f":"RecordingSheet!D133","v":"Molly Atchison"},{"$f":"RecordingSheet!F133","v":22.53},"C","BOYS","BREASTSTROKE",{"$f":"RecordingSheet!D139","v":"Alfie McFaull"},{"$f":"RecordingSheet!F139","v":22.78}]
[null,"C",{"$f":"RecordingSheet!$A$56","v":"GIRLS"},"BREASTSTROKE",{"$f":"RecordingSheet!D134","v":"Faye Dempsey"},{"$f":"RecordingSheet!F134","v":29.22},"C","BOYS","BREASTSTROKE",{"$f":"RecordingSheet!D140","v":""},{"$f":"RecordingSheet!F140","v":0}]
[null,"D",{"$f":"RecordingSheet!$A$56","v":"GIRLS"},"BREASTSTROKE",{"$f":"RecordingSheet!D144","v":"Jessica Dunlop"},{"$f":"RecordingSheet!F144","v":26.25},"D","BOYS","BREASTSTROKE",{"$f":"RecordingSheet!D150","v":"Jamie Watson"},{"$f":"RecordingSheet!F150","v":25.54}]
[null,"D",{"$f":"RecordingSheet!$A$56","v":"GIRLS"},"BREASTSTROKE",{"$f":"RecordingSheet!D145","v":"Tea McWilliam"},{"$f":"RecordingSheet!F145","v":23.32},"D","BOYS","BREASTSTROKE",{"$f":"RecordingSheet!D151","v":"Jack Dempsey"},{"$f":"RecordingSheet!F151","v":25.75}]
[null,"D",{"$f":"RecordingSheet!$A$56","v":"GIRLS"},"BREASTSTROKE",{"$f":"RecordingSheet!D146","v":"Leah Scullion"},{"$f":"RecordingSheet!F146","v":24.36},"D","BOYS","BREASTSTROKE",{"$f":"RecordingSheet!D152","v":""},{"$f":"RecordingSheet!F152","v":0}]
[null,{"$f":"RecordingSheet!$A$55","v":"A"},{"$f":"RecordingSheet!$A$56","v":"GIRLS"},"BUTTERFLY",{"$f":"RecordingSheet!D163","v":"Leanne Balmer"},{"$f":"RecordingSheet!F163","v":35.28},{"$f":"RecordingSheet!$A$55","v":"A"},"BOYS","BUTTERFLY",{"$f":"RecordingSheet!D169","v":"Harris Fleming"},{"$f":"RecordingSheet!F169","v":30.09}]
[null,{"$f":"RecordingSheet!$A$55","v":"A"},{"$f":"RecordingSheet!$A$56","v":"GIRLS"},"BUTTERFLY",{"$f":"RecordingSheet!D164","v":"Jayne McNeill"},{"$f":"RecordingSheet!F164","v":25.96},{"$f":"RecordingSheet!$A$55","v":"A"},"BOYS","BUTTERFLY",{"$f":"RecordingSheet!D170","v":"Matthew Nicholl"},{"$f":"RecordingSheet!F170","v":32.56}]
[null,{"$f":"RecordingSheet!$A$55","v":"A"},{"$f":"RecordingSheet!$A$56","v":"GIRLS"},"BUTTERFLY",{"$f":"RecordingSheet!D165","v":"Erin Murray"},{"$f":"RecordingSheet!F165","v":43.5},{"$f":"RecordingSheet!$A$55","v":"A"},"BOYS","BUTTERFLY",{"$f":"RecordingSheet!D171","v":""},{"$f":"RecordingSheet!F171","v":0}]
[null,"B",{"$f":"RecordingSheet!$A$56","v":"GIRLS"},"BUTTERFLY",{"$f":"RecordingSheet!D175","v":"Daisy Dunlop"},{"$f":"RecordingSheet!F175","v":37.700000000000003},"B","BOYS","BUTTERFLY",{"$f":"RecordingSheet!D181","v":"Joe Colley"},{"$f":"RecordingSheet!F181","v":24.66}]
[null,"B",{"$f":"RecordingSheet!$A$56","v":"GIRLS"},"BUTTERFLY",{"$f":"RecordingSheet!D176","v":"Sophie McCormick"},{"$f":"RecordingSheet!F176","v":21.59},"B","BOYS","BUTTERFLY",{"$f":"RecordingSheet!D182","v":"James Green"},{"$f":"RecordingSheet!F182","v":21.63}]
[null,"B",{"$f":"RecordingSheet!$A$56","v":"GIRLS"},"BUTTERFLY",{"$f":"RecordingSheet!D177","v":"Rachael Hill"},{"$f":"RecordingSheet!F177","v":38},"B","BOYS","BUTTERFLY",{"$f":"RecordingSheet!D183","v":""},{"$f":"RecordingSheet!F183","v":0}]
[null,"C",{"$f":"RecordingSheet!$A$56","v":"GIRLS"},"BUTTERFLY",{"$f":"RecordingSheet!D187","v":"Chloe Nicholl"},{"$f":"RecordingSheet!F187","v":26.66},"C","BOYS","BUTTERFLY",{"$f":"RecordingSheet!D193","v":"Reece Doherty"},{"$f":"RecordingSheet!F193","v":21.91}]
[null,"C",{"$f":"RecordingSheet!$A$56","v":"GIRLS"},"BUTTERFLY",{"$f":"RecordingSheet!D188","v":"Molly Atchison"},{"$f":"RecordingSheet!F188","v":19.43},"C","BOYS","BUTTERFLY",{"$f":"RecordingSheet!D194","v":"Alfie McFaull"},{"$f":"RecordingSheet!F194","v":22.63}]
[null,"C",{"$f":"RecordingSheet!$A$56","v":"GIRLS"},"BUTTERFLY",{"$f":"RecordingSheet!D189","v":"Izzi Pollock-Quinn"},{"$f":"RecordingSheet!F189","v":34.19},"C","BOYS","BUTTERFLY",{"$f":"RecordingSheet!D195","v":""},{"$f":"RecordingSheet!F195","v":0}]
[null,"D",{"$f":"RecordingSheet!$A$56","v":"GIRLS"},"BUTTERFLY",{"$f":"RecordingSheet!D199","v":"Jessica Dunlop"},{"$f":"RecordingSheet!F199","v":21.36},"D","BOYS","BUTTERFLY",{"$f":"RecordingSheet!D205","v":"Jamie Watson"},{"$f":"RecordingSheet!F205","v":26.2}]
[null,"D",{"$f":"RecordingSheet!$A$56","v":"GIRLS"},"BUTTERFLY",{"$f":"RecordingSheet!D200","v":"Tea McWilliam"},{"$f":"RecordingSheet!F200","v":18.16},"D","BOYS","BUTTERFLY",{"$f":"RecordingSheet!D206","v":"Angus Loughridge"},{"$f":"RecordingSheet!F206","v":24.75}]
[null,"D",{"$f":"RecordingSheet!$A$56","v":"GIRLS"},"BUTTERFLY",{"$f":"RecordingSheet!D201","v":"Lucy Maguire"},{"$f":"RecordingSheet!F201","v":21.5},"D","BOYS","BUTTERFLY",{"$f":"RecordingSheet!D207","v":""},{"$f":"RecordingSheet!F207","v":0}]
[null,{"$f":"RecordingSheet!$A$55","v":"A"},{"$f":"RecordingSheet!$A$56","v":"GIRLS"},"FRONT CRAWL",{"$f":"RecordingSheet!D218","v":"Leanne Balmer"},{"$f":"RecordingSheet!F218","v":27},{"$f":"RecordingSheet!$A$55","v":"A"},"BOYS","FRONT CRAWL",{"$f":"RecordingSheet!D224","v":"Harris Fleming"},{"$f":"RecordingSheet!F224","v":23.16}]
[null,{"$f":"RecordingSheet!$A$55","v":"A"},{"$f":"RecordingSheet!$A$56","v":"GIRLS"},"FRONT CRAWL",{"$f":"RecordingSheet!D219","v":"Jayne McNeill"},{"$f":"RecordingSheet!F219","v":22.4},{"$f":"RecordingSheet!$A$55","v":"A"},"BOYS","FRONT CRAWL",{"$f":"RecordingSheet!D225","v":"Matthew Nicholl"},{"$f":"RecordingSheet!F225","v":25.19}]
[null,{"$f":"RecordingSheet!$A$55","v":"A"},{"$f":"RecordingSheet!$A$56","v":"GIRLS"},"FRONT CRAWL",{"$f":"RecordingSheet!D220","v":"Erin Murray"},{"$f":"RecordingSheet!F220","v":35.97},{"$f":"RecordingSheet!$A$55","v":"A"},"BOYS","FRONT CRAWL",{"$f":"RecordingSheet!D226","v":""},{"$f":"RecordingSheet!F226","v":0}]
[null,"B",{"$f":"RecordingSheet!$A$56","v":"GIRLS"},"FRONT CRAWL",{"$f":"RecordingSheet!D230","v":"Daisy Dunlop"},{"$f":"RecordingSheet!F230","v":28.91},"B","BOYS","FRONT CRAWL",{"$f":"RecordingSheet!D236","v":"Joe Colley"},{"$f":"RecordingSheet!F236","v":19.48}]
[null,"B",{"$f":"RecordingSheet!$A$56","v":"GIRLS"},"FRONT CRAWL",{"$f":"RecordingSheet!D231","v":"Sophie McCormick"},{"$f":"RecordingSheet!F231","v":20.34},"B","BOYS","FRONT CRAWL",{"$f":"RecordingSheet!D237","v":"James Green"},{"$f":"RecordingSheet!F237","v":18.88}]
[null,"B",{"$f":"RecordingSheet!$A$56","v":"GIRLS"},"FRONT CRAWL",{"$f":"RecordingSheet!D232","v":"Leah Atkinson"},{"$f":"RecordingSheet!F232","v":31.13},"B","BOYS","FRONT CRAWL",{"$f":"RecordingSheet!D238","v":""},{"$f":"RecordingSheet!F238","v":0}]
[null,"C",{"$f":"RecordingSheet!$A$56","v":"GIRLS"},"FRONT CRAWL",{"$f":"RecordingSheet!D242","v":"Chloe Nicholl"},{"$f":"RecordingSheet!F242","v":19.73},"C","BOYS","FRONT CRAWL",{"$f":"RecordingSheet!D248","v":"Reece Doherty"},{"$f":"RecordingSheet!F248","v":18.02}]
[null,"C",{"$f":"RecordingSheet!$A$56","v":"GIRLS"},"FRONT CRAWL",{"$f":"RecordingSheet!D243","v":"Molly Atchison"},{"$f":"RecordingSheet!F243","v":16.940000000000001},"C","BOYS","FRONT CRAWL",{"$f":"RecordingSheet!D249","v":"Alfie McFaull"},{"$f":"RecordingSheet!F249","v":19.43}]
[null,"C",{"$f":"RecordingSheet!$A$56","v":"GIRLS"},"FRONT CRAWL",{"$f":"RecordingSheet!D244","v":"Faye Dempsey"},{"$f":"RecordingSheet!F244","v":20.65},"C","BOYS","FRONT CRAWL",{"$f":"RecordingSheet!D250","v":""},{"$f":"RecordingSheet!F250","v":0}]
[null,"D",{"$f":"RecordingSheet!$A$56","v":"GIRLS"},"FRONT CRAWL",{"$f":"RecordingSheet!D254","v":"Jessica Dunlop"},{"$f":"RecordingSheet!F254","v":18.88},"D","BOYS","FRONT CRAWL",{"$f":"RecordingSheet!D260","v":"Jamie Watson"},{"$f":"RecordingSheet!F260","v":19.510000000000002}]
[null,"D",{"$f":"RecordingSheet!$A$56","v":"GIRLS"},"FRONT CRAWL",{"$f":"RecordingSheet!D255","v":"Tea McWilliam"},{"$f":"RecordingSheet!F255","v":16.61},"D","BOYS","FRONT CRAWL",{"$f":"RecordingSheet!D261","v":"Jack Dempsey"},{"$f":"RecordingSheet!F261","v":20.03}]
[null,"D",{"$f":"RecordingSheet!$A$56","v":"GIRLS"},"FRONT CRAWL",{"$f":"RecordingSheet!D256","v":"Lucy Maguire"},{"$f":"RecordingSheet!F256","v":19},"D","BOYS","FRONT CRAWL",{"$f":"RecordingSheet!D262","v":""},{"$f":"RecordingSheet!F262","v":0}]